=> Bootstrap dependency digest>=20211023: found digest-20220214
===> Skipping vulnerability checks.
WARNING: No /usr/pkg/pkgdb/pkg-vulnerabilities file found.
WARNING: To fix run: `/usr/sbin/pkg_admin -K /usr/pkg/pkgdb fetch-pkg-vulnerabilities'.
===> Building for rabbitmq-3.13.7
=> Setting standard paths
=> Setting prefix path
warning: the VM is running with native name encoding of latin1 which may cause Elixir to malfunction as it expects utf8. Please ensure your locale is set to UTF-8 (which can be verified by running "locale" in your shell) or set the ELIXIR_ERL_OPTIONS="+fnu" environment variable
warning: single-quoted strings represent charlists. Use ~c"" if you indeed want a charlist or use "" instead
\x{2514}\x{2500} nofile:1:12

 GEN    deps/.hex/cache.ets
 GEN    install-cli-scripts
 GEN    install-cli-escripts
gmake[1]: Entering directory '/pbulk/work/net/rabbitmq/work/rabbitmq-server-3.13.7/deps/rabbitmq_cli'
 GEN    escript/rabbitmqctl
warning: the VM is running with native name encoding of latin1 which may cause Elixir to malfunction as it expects utf8. Please ensure your locale is set to UTF-8 (which can be verified by running "locale" in your shell) or set the ELIXIR_ERL_OPTIONS="+fnu" environment variable
Resolving Hex dependencies...
Resolution completed in 0.011s
Unchanged:
  recon 2.5.5
* Getting recon (Hex package)
gmake[2]: Entering directory '/pbulk/work/net/rabbitmq/work/rabbitmq-server-3.13.7/deps/stdout_formatter'
gmake[1]: Entering directory '/pbulk/work/net/rabbitmq/work/rabbitmq-server-3.13.7/deps/rabbit_common'
 DEPEND stdout_formatter.d
gmake[2]: Entering directory '/pbulk/work/net/rabbitmq/work/rabbitmq-server-3.13.7/deps/thoas'
 DEPEND thoas.d
 ERLC   stdout_formatter.erl stdout_formatter_paragraph.erl stdout_formatter_table.erl stdout_formatter_utils.erl
 ERLC   thoas.erl thoas_decode.erl thoas_encode.erl
Old inliner: threshold=0 functions=[{array,6},
                                    {object,6},
                                    {token_error,3},
                                    {token_error,2},
                                    {throw_error,2},
                                    {continue,6}]
 APP    stdout_formatter.app.src
gmake[2]: Leaving directory '/pbulk/work/net/rabbitmq/work/rabbitmq-server-3.13.7/deps/stdout_formatter'
==> json
Compiling 13 files (.ex)
    warning: single-quoted strings represent charlists. Use ~c"" if you indeed want a charlist or use "" instead
    \x{2502}
 89 \x{2502}   defp apply_exponent({:ok, acc, <<exponent::utf8, rest::binary>>}) when exponent in 'eE' do
    \x{2502}                                                                                      ~
    \x{2502}
    \x{2514}\x{2500} lib/json/parser/number.ex:89:86

    warning: use Bitwise is deprecated. import Bitwise instead
    \x{2502}
  6 \x{2502}   use Bitwise
    \x{2502}   ~~~~~~~~~~~
    \x{2502}
    \x{2514}\x{2500} lib/json/parser/unicode.ex:6: JSON.Parser.Unicode (module)

    warning: use Bitwise is deprecated. import Bitwise instead
    \x{2502}
  8 \x{2502}   use Bitwise
    \x{2502}   ~~~~~~~~~~~
    \x{2502}
    \x{2514}\x{2500} lib/json/parser/string.ex:8: JSON.Parser.String (module)

Generated json app
Old inliner: threshold=0 functions=[{float,1},
                                    {integer,1},
                                    {error_invalid_byte_error,2}]
==> recon
Compiling 6 files (.erl)
Generated recon app
==> csv
Compiling 7 files (.ex)
 APP    thoas.app.src
gmake[2]: Leaving directory '/pbulk/work/net/rabbitmq/work/rabbitmq-server-3.13.7/deps/thoas'
gmake[2]: Entering directory '/pbulk/work/net/rabbitmq/work/rabbitmq-server-3.13.7/deps/ranch'
 DEPEND ranch.d
 ERLC   ranch.erl ranch_acceptor.erl ranch_acceptors_sup.erl ranch_app.erl ranch_conns_sup.erl ranch_conns_sup_sup.erl ranch_crc32c.erl ranch_embedded_sup.erl ranch_listener_sup.erl ranch_protocol.erl ranch_proxy_header.erl ranch_server.erl ranch_server_proxy.erl ranch_ssl.erl ranch_sup.erl ranch_tcp.erl ranch_transport.erl
Generated csv app
==> rabbitmqctl
gmake[2]: Entering directory '/pbulk/work/net/rabbitmq/work/rabbitmq-server-3.13.7/deps/rabbit_common'
gmake[3]: Entering directory '/pbulk/work/net/rabbitmq/work/rabbitmq-server-3.13.7/deps/ranch'
 ERLC   ranch.erl ranch_acceptor.erl ranch_acceptors_sup.erl ranch_app.erl ranch_conns_sup.erl ranch_conns_sup_sup.erl ranch_crc32c.erl ranch_embedded_sup.erl ranch_listener_sup.erl ranch_protocol.erl ranch_proxy_header.erl ranch_server.erl ranch_server_proxy.erl ranch_ssl.erl ranch_sup.erl ranch_tcp.erl ranch_transport.erl
 APP    ranch
gmake[2]: Leaving directory '/pbulk/work/net/rabbitmq/work/rabbitmq-server-3.13.7/deps/ranch'
gmake[2]: Entering directory '/pbulk/work/net/rabbitmq/work/rabbitmq-server-3.13.7/deps/recon'
 DEPEND recon.d
 APP    ranch
 ERLC   recon.erl recon_alloc.erl recon_lib.erl recon_map.erl recon_rec.erl recon_trace.erl
gmake[3]: Leaving directory '/pbulk/work/net/rabbitmq/work/rabbitmq-server-3.13.7/deps/ranch'
gmake[3]: Entering directory '/pbulk/work/net/rabbitmq/work/rabbitmq-server-3.13.7/deps/credentials_obfuscation'
 DEPEND credentials_obfuscation.d
 ERLC   credentials_obfuscation.erl credentials_obfuscation_app.erl credentials_obfuscation_pbe.erl credentials_obfuscation_sup.erl credentials_obfuscation_svc.erl
src/recon_alloc.erl:702:7: Warning: matching on the float 0.0 will no longer also match -0.0 in OTP 27.
If you specifically intend to match 0.0 alone, write +0.0 instead.
%  702| usage(0.0,0.0) -> 1.00;
%     |       ^

src/recon_alloc.erl:702:11: Warning: matching on the float 0.0 will no longer also match -0.0 in OTP 27.
If you specifically intend to match 0.0 alone, write +0.0 instead.
%  702| usage(0.0,0.0) -> 1.00;
%     |           ^

Old inliner: threshold=0 functions=[{insert,2},{merge,2}]
 APP    credentials_obfuscation.app.src
gmake[3]: Leaving directory '/pbulk/work/net/rabbitmq/work/rabbitmq-server-3.13.7/deps/credentials_obfuscation'
 DEPEND rabbit_common.d
 APP    recon.app.src
gmake[2]: Leaving directory '/pbulk/work/net/rabbitmq/work/rabbitmq-server-3.13.7/deps/recon'
 DEPEND rabbit_common.d
 ERLC   app_utils.erl code_version.erl credit_flow.erl delegate.erl delegate_sup.erl file_handle_cache.erl file_handle_cache_stats.erl gen_server2.erl mirrored_supervisor_locks.erl mnesia_sync.erl pmon.erl priority_queue.erl rabbit_amqp_connection.erl rabbit_amqqueue_common.erl rabbit_auth_backend_dummy.erl rabbit_auth_mechanism.erl rabbit_authn_backend.erl rabbit_authz_backend.erl rabbit_basic_common.erl rabbit_binary_generator.erl rabbit_binary_parser.erl rabbit_cert_info.erl rabbit_channel_common.erl rabbit_command_assembler.erl rabbit_control_misc.erl rabbit_core_metrics.erl rabbit_data_coercion.erl rabbit_date_time.erl rabbit_env.erl rabbit_error_logger_handler.erl rabbit_event.erl rabbit_framing.erl rabbit_framing_amqp_0_8.erl rabbit_framing_amqp_0_9_1.erl rabbit_heartbeat.erl rabbit_http_util.erl rabbit_json.erl rabbit_log.erl rabbit_misc.erl rabbit_msg_store_index.erl rabbit_net.erl rabbit_nodes_common.erl rabbit_numerical.erl rabbit_password.erl rabbit_password_hashing.erl rabbit_password_hashing_md5.erl rabbit_password_hashing_sha256.erl rabbit_password_hashing_sha512.erl rabbit_pbe.erl rabbit_peer_discovery_backend.erl rabbit_policy_validator.erl rabbit_queue_collector.erl rabbit_registry.erl rabbit_registry_class.erl rabbit_resource_monitor_misc.erl rabbit_runtime.erl rabbit_runtime_parameter.erl rabbit_semver.erl rabbit_semver_parser.erl rabbit_ssl_options.erl rabbit_types.erl rabbit_writer.erl supervisor2.erl vm_memory_monitor.erl worker_pool.erl worker_pool_sup.erl worker_pool_worker.erl
 ERLC   app_utils.erl code_version.erl credit_flow.erl delegate.erl delegate_sup.erl file_handle_cache.erl file_handle_cache_stats.erl gen_server2.erl mirrored_supervisor_locks.erl mnesia_sync.erl pmon.erl priority_queue.erl rabbit_amqp_connection.erl rabbit_amqqueue_common.erl rabbit_auth_backend_dummy.erl rabbit_auth_mechanism.erl rabbit_authn_backend.erl rabbit_authz_backend.erl rabbit_basic_common.erl rabbit_binary_generator.erl rabbit_binary_parser.erl rabbit_cert_info.erl rabbit_channel_common.erl rabbit_command_assembler.erl rabbit_control_misc.erl rabbit_core_metrics.erl rabbit_data_coercion.erl rabbit_date_time.erl rabbit_env.erl rabbit_error_logger_handler.erl rabbit_event.erl rabbit_framing.erl rabbit_framing_amqp_0_8.erl rabbit_framing_amqp_0_9_1.erl rabbit_heartbeat.erl rabbit_http_util.erl rabbit_json.erl rabbit_log.erl rabbit_misc.erl rabbit_msg_store_index.erl rabbit_net.erl rabbit_nodes_common.erl rabbit_numerical.erl rabbit_password.erl rabbit_password_hashing.erl rabbit_password_hashing_md5.erl rabbit_password_hashing_sha256.erl rabbit_password_hashing_sha512.erl rabbit_pbe.erl rabbit_peer_discovery_backend.erl rabbit_policy_validator.erl rabbit_queue_collector.erl rabbit_registry.erl rabbit_registry_class.erl rabbit_resource_monitor_misc.erl rabbit_runtime.erl rabbit_runtime_parameter.erl rabbit_semver.erl rabbit_semver_parser.erl rabbit_ssl_options.erl rabbit_types.erl rabbit_writer.erl supervisor2.erl vm_memory_monitor.erl worker_pool.erl worker_pool_sup.erl worker_pool_worker.erl
/pbulk/work/net/rabbitmq/work/rabbitmq-server-3.13.7/deps/rabbit_common/ebin/file_handle_cache_stats.beam: failed to rename /pbulk/work/net/rabbitmq/work/rabbitmq-server-3.13.7/deps/rabbit_common/ebin/file_handle_cache_stats.bea# to /pbulk/work/net/rabbitmq/work/rabbitmq-server-3.13.7/deps/rabbit_common/ebin/file_handle_cache_stats.beam: no such file or directory
gmake[2]: *** [erlang.mk:4761: ebin/rabbit_common.app] Error 1
gmake[1]: *** [erlang.mk:4502: app] Error 2
gmake[1]: Leaving directory '/pbulk/work/net/rabbitmq/work/rabbitmq-server-3.13.7/deps/rabbit_common'
gmake: *** [erlang.mk:3753: deps] Error 2
gmake: *** Waiting for unfinished jobs....
 APP    rabbit_common
gmake[2]: Leaving directory '/pbulk/work/net/rabbitmq/work/rabbitmq-server-3.13.7/deps/rabbit_common'
gmake[2]: Entering directory '/pbulk/work/net/rabbitmq/work/rabbitmq-server-3.13.7/deps/observer_cli'
 DEPEND observer_cli.d
 ERLC   observer_cli.erl observer_cli_application.erl observer_cli_escriptize.erl observer_cli_ets.erl observer_cli_help.erl observer_cli_inet.erl observer_cli_lib.erl observer_cli_mnesia.erl observer_cli_plugin.erl observer_cli_port.erl observer_cli_process.erl observer_cli_store.erl observer_cli_system.erl
Inlining: inline_size=24 inline_effort=150
 APP    observer_cli.app.src
gmake[2]: Leaving directory '/pbulk/work/net/rabbitmq/work/rabbitmq-server-3.13.7/deps/observer_cli'
gmake[2]: Entering directory '/pbulk/work/net/rabbitmq/work/rabbitmq-server-3.13.7/deps/stdout_formatter'
gmake[2]: Leaving directory '/pbulk/work/net/rabbitmq/work/rabbitmq-server-3.13.7/deps/stdout_formatter'
gmake[2]: Entering directory '/pbulk/work/net/rabbitmq/work/rabbitmq-server-3.13.7/deps/rabbit_common'
gmake[2]: Leaving directory '/pbulk/work/net/rabbitmq/work/rabbitmq-server-3.13.7/deps/rabbit_common'
gmake[2]: Entering directory '/pbulk/work/net/rabbitmq/work/rabbitmq-server-3.13.7/deps/observer_cli'
gmake[2]: Leaving directory '/pbulk/work/net/rabbitmq/work/rabbitmq-server-3.13.7/deps/observer_cli'
Compiling 245 files (.ex)
warning: 0..-2 has a default step of -1, please write 0..-2//-1 instead
  lib/rabbitmq/cli/diagnostics/commands/check_certificate_expiration_command.ex:80: RabbitMQ.CLI.Diagnostics.Commands.CheckCertificateExpirationCommand.unit_label/2

Generated rabbitmqctl app
Generated escript escript/rabbitmqctl with MIX_ENV=dev
 GEN    escript/rabbitmq-diagnostics
 GEN    escript/vmware-rabbitmq
 GEN    escript/rabbitmq-upgrade
 GEN    escript/rabbitmq-streams
 GEN    escript/rabbitmq-queues
 GEN    escript/rabbitmq-plugins
 GEN    install
gmake[1]: Leaving directory '/pbulk/work/net/rabbitmq/work/rabbitmq-server-3.13.7/deps/rabbitmq_cli'
*** Error code 2

Stop.
make[1]: stopped in /usr/pkgsrc/net/rabbitmq
*** Error code 1

Stop.
make: stopped in /usr/pkgsrc/net/rabbitmq