=> Bootstrap dependency digest>=20211023: found digest-20220214
===> Skipping vulnerability checks.
WARNING: No /usr/pkg/pkgdb/pkg-vulnerabilities file found.
WARNING: To fix run: `/usr/sbin/pkg_admin -K /usr/pkg/pkgdb fetch-pkg-vulnerabilities'.
===> Building for qt6-qtgrpc-6.6.3nb2
[  1%] Running syncqt.cpp for module: QtProtobuf
[  2%] Building CXX object src/tools/qtprotoccommon/CMakeFiles/QtProtocCommon.dir/baseprinter.cpp.o
[  4%] Generating ../../../mkspecs/modules/qt_lib_protobufqtguitypes_private.pri
[  4%] Generating ../../mkspecs/modules/qt_lib_protobufwellknowntypes_private.pri
[  5%] Generating ../../mkspecs/modules/qt_lib_protobuf_private.pri
[  6%] Generating ../../mkspecs/modules/qt_lib_grpc_private.pri
[  7%] Running syncqt.cpp for module: QtProtobuf
[  8%] Generating ../../../mkspecs/modules/qt_lib_protobufqtcoretypes_private.pri
[  8%] Built target ProtobufQtGuiTypes_lib_pri
[  8%] Built target Protobuf_lib_pri
[  8%] Built target ProtobufWellKnownTypes_lib_pri
[  8%] Built target Grpc_lib_pri
[  9%] Building CXX object src/tools/qtprotoccommon/CMakeFiles/QtProtocCommon.dir/generatorbase.cpp.o
[  9%] Building CXX object src/tools/qtprotoccommon/CMakeFiles/QtProtocCommon.dir/generatorcommon.cpp.o
[  9%] Built target ProtobufQtCoreTypes_lib_pri
[ 10%] Building CXX object src/tools/qtprotoccommon/CMakeFiles/QtProtocCommon.dir/options.cpp.o
[ 11%] Building CXX object src/tools/qtprotoccommon/CMakeFiles/QtProtocCommon.dir/commontemplates.cpp.o
[ 12%] Building CXX object src/tools/qtprotoccommon/CMakeFiles/QtProtocCommon.dir/utils.cpp.o
[ 12%] Built target Protobuf_sync_headers
[ 13%] Generating version linker script for target Protobuf
[ 14%] Running syncqt.cpp for module: QtGrpc
[ 14%] Built target Protobuf_version_script
[ 15%] Running syncqt.cpp for module: QtGrpc
[ 15%] Built target Grpc_sync_headers
[ 16%] Generating version linker script for target Grpc
[ 16%] Built target Protobuf_autogen_timestamp_deps
[ 16%] Built target Grpc_version_script
[ 16%] Automatic MOC for target Protobuf
[ 16%] Built target Protobuf_autogen
[ 17%] Running AUTOMOC file extraction for target Protobuf
[ 17%] Built target Protobuf_automoc_json_extraction
[ 18%] Generating pc file for target Qt6::Protobuf
[ 19%] Generating prl file for target Protobuf
[ 19%] Running moc --collect-json for target Protobuf
[ 21%] Building CXX object src/protobuf/CMakeFiles/Protobuf.dir/Protobuf_autogen/mocs_compilation.cpp.o
[ 21%] Building CXX object src/protobuf/CMakeFiles/Protobuf.dir/qabstractprotobufserializer.cpp.o
[ 22%] Building CXX object src/protobuf/CMakeFiles/Protobuf.dir/qprotobufmessage.cpp.o
In file included from /pbulk/work/net/qt6-qtgrpc/work/qtgrpc-everywhere-src-6.6.3/src/tools/qtprotoccommon/baseprinter.cpp:7:
/pbulk/work/net/qt6-qtgrpc/work/.buildlink/include/google/protobuf/io/printer.h: In instantiation of 'void google::protobuf::io::Printer::Print(absl::lts_20240116::string_view, const Args& ...) [with Args = {}]':
/pbulk/work/net/qt6-qtgrpc/work/qtgrpc-everywhere-src-6.6.3/src/tools/qtprotoccommon/baseprinter.cpp:19:60:   required from here
/pbulk/work/net/qt6-qtgrpc/work/.buildlink/include/google/protobuf/io/printer.h:1079:24: warning: comparison of unsigned expression in '< 0' is always false [-Wtype-limits]
 1079 |   for (size_t i = 0; i < sizeof...(args); i += 2) {
      |                      ~~^~~~~~~~~~~~~~~~~
[ 23%] Building CXX object src/protobuf/CMakeFiles/Protobuf.dir/qprotobufserializer.cpp.o
In file included from /pbulk/work/net/qt6-qtgrpc/work/qtgrpc-everywhere-src-6.6.3/src/tools/qtprotoccommon/generatorbase.cpp:8:
/pbulk/work/net/qt6-qtgrpc/work/.buildlink/include/google/protobuf/io/printer.h: In instantiation of 'void google::protobuf::io::Printer::Print(absl::lts_20240116::string_view, const Args& ...) [with Args = {}]':
/pbulk/work/net/qt6-qtgrpc/work/qtgrpc-everywhere-src-6.6.3/src/tools/qtprotoccommon/generatorbase.cpp:49:57:   required from here
/pbulk/work/net/qt6-qtgrpc/work/.buildlink/include/google/protobuf/io/printer.h:1079:24: warning: comparison of unsigned expression in '< 0' is always false [-Wtype-limits]
 1079 |   for (size_t i = 0; i < sizeof...(args); i += 2) {
      |                      ~~^~~~~~~~~~~~~~~~~
[ 24%] Building CXX object src/protobuf/CMakeFiles/Protobuf.dir/qtprotobuflogging.cpp.o
[ 24%] Building CXX object src/protobuf/CMakeFiles/Protobuf.dir/qtprotobuftypes.cpp.o
[ 25%] Building CXX object src/protobuf/CMakeFiles/Protobuf.dir/qprotobufoneof.cpp.o
[ 26%] Linking CXX static library libQtProtocCommon.a
[ 26%] Built target QtProtocCommon
[ 27%] Building CXX object src/tools/qtprotobufgen/CMakeFiles/qtprotobufgen.dir/main.cpp.o
[ 28%] Building CXX object src/tools/qtprotobufgen/CMakeFiles/qtprotobufgen.dir/messagedeclarationprinter.cpp.o
[ 30%] Building CXX object src/tools/qtgrpcgen/CMakeFiles/qtgrpcgen.dir/main.cpp.o
[ 31%] Building CXX object src/tools/qtprotobufgen/CMakeFiles/qtprotobufgen.dir/qprotobufgenerator.cpp.o
[ 31%] Building CXX object src/tools/qtgrpcgen/CMakeFiles/qtgrpcgen.dir/qgrpcgenerator.cpp.o
[ 32%] Building CXX object src/tools/qtgrpcgen/CMakeFiles/qtgrpcgen.dir/grpctemplates.cpp.o
[ 34%] Building CXX object src/tools/qtgrpcgen/CMakeFiles/qtgrpcgen.dir/serverdeclarationprinter.cpp.o
[ 35%] Building CXX object src/tools/qtgrpcgen/CMakeFiles/qtgrpcgen.dir/clientdeclarationprinter.cpp.o
/pbulk/work/net/qt6-qtgrpc/work/qtgrpc-everywhere-src-6.6.3/src/tools/qtprotobufgen/qprotobufgenerator.cpp: In lambda function:
/pbulk/work/net/qt6-qtgrpc/work/qtgrpc-everywhere-src-6.6.3/src/tools/qtprotobufgen/qprotobufgenerator.cpp:279:53: error: 'bool google::protobuf::FieldDescriptor::has_optional_keyword() const' is private within this context
  279 |                     if (field->has_optional_keyword())
      |                                                     ^
In file included from /usr/pkg/include/google/protobuf/compiler/retention.h:11,
                 from /usr/pkg/include/google/protobuf/compiler/code_generator.h:25,
                 from /pbulk/work/net/qt6-qtgrpc/work/qtgrpc-everywhere-src-6.6.3/src/tools/qtprotoccommon/generatorbase.h:8,
                 from /pbulk/work/net/qt6-qtgrpc/work/qtgrpc-everywhere-src-6.6.3/src/tools/qtprotobufgen/qprotobufgenerator.h:8,
                 from /pbulk/work/net/qt6-qtgrpc/work/qtgrpc-everywhere-src-6.6.3/src/tools/qtprotobufgen/qprotobufgenerator.cpp:5:
/usr/pkg/include/google/protobuf/descriptor.h:1043:8: note: declared private here
 1043 |   bool has_optional_keyword() const;
      |        ^~~~~~~~~~~~~~~~~~~~
[ 36%] Building CXX object src/tools/qtgrpcgen/CMakeFiles/qtgrpcgen.dir/clientdefinitionprinter.cpp.o
[ 37%] Building CXX object src/tools/qtprotobufgen/CMakeFiles/qtprotobufgen.dir/messagedefinitionprinter.cpp.o
gmake[2]: *** [src/tools/qtprotobufgen/CMakeFiles/qtprotobufgen.dir/build.make:90: src/tools/qtprotobufgen/CMakeFiles/qtprotobufgen.dir/qprotobufgenerator.cpp.o] Error 1
gmake[2]: *** Waiting for unfinished jobs....
[ 38%] Linking CXX shared library ../../lib/libQt6Protobuf.so
[ 38%] Built target Protobuf
[ 38%] Built target Grpc_autogen_timestamp_deps
[ 39%] Automatic MOC for target Grpc
[ 39%] Linking CXX executable ../../../libexec/qtgrpcgen
[ 39%] Built target qtgrpcgen
[ 39%] Built target Grpc_autogen
[ 40%] Running AUTOMOC file extraction for target Grpc
[ 40%] Built target Grpc_automoc_json_extraction
[ 41%] Generating prl file for target Grpc
[ 41%] Running moc --collect-json for target Grpc
[ 42%] Generating pc file for target Qt6::Grpc
[ 43%] Building CXX object src/grpc/CMakeFiles/Grpc.dir/Grpc_autogen/mocs_compilation.cpp.o
[ 44%] Building CXX object src/grpc/CMakeFiles/Grpc.dir/qgrpcoperation.cpp.o
[ 46%] Building CXX object src/grpc/CMakeFiles/Grpc.dir/qgrpcstream.cpp.o
[ 46%] Building CXX object src/grpc/CMakeFiles/Grpc.dir/qgrpccallreply.cpp.o
[ 47%] Building CXX object src/grpc/CMakeFiles/Grpc.dir/qabstractgrpcchannel.cpp.o
[ 48%] Building CXX object src/grpc/CMakeFiles/Grpc.dir/qgrpchttp2channel.cpp.o
[ 48%] Building CXX object src/grpc/CMakeFiles/Grpc.dir/qgrpcstatus.cpp.o
gmake[1]: *** [CMakeFiles/Makefile2:2331: src/tools/qtprotobufgen/CMakeFiles/qtprotobufgen.dir/all] Error 2
gmake[1]: *** Waiting for unfinished jobs....
[ 49%] Building CXX object src/grpc/CMakeFiles/Grpc.dir/qabstractgrpcclient.cpp.o
[ 50%] Building CXX object src/grpc/CMakeFiles/Grpc.dir/qgrpccalloptions.cpp.o
[ 51%] Building CXX object src/grpc/CMakeFiles/Grpc.dir/qgrpcchanneloptions.cpp.o
[ 52%] Building CXX object src/grpc/CMakeFiles/Grpc.dir/qtgrpcglobal.cpp.o
[ 53%] Building CXX object src/grpc/CMakeFiles/Grpc.dir/qgrpcchannel.cpp.o
[ 53%] Linking CXX shared library ../../lib/libQt6Grpc.so
[ 53%] Built target Grpc
gmake: *** [Makefile:146: all] Error 2
*** Error code 2

Stop.
make[1]: stopped in /usr/pkgsrc/net/qt6-qtgrpc
*** Error code 1

Stop.
make: stopped in /usr/pkgsrc/net/qt6-qtgrpc