=> Bootstrap dependency digest>=20211023: found digest-20220214
===> Skipping vulnerability checks.
WARNING: No /usr/pkg/pkgdb/pkg-vulnerabilities file found.
WARNING: To fix run: `/usr/sbin/pkg_admin -K /usr/pkg/pkgdb fetch-pkg-vulnerabilities'.
===> Installing for ibus-hangul-1.5.0nb6
=> Generating pre-install file lists
Making install in src
gmake[1]: Entering directory '/pbulk/work/inputmethod/ibus-hangul/work/ibus-hangul-1.5.0/src'
gmake[2]: Entering directory '/pbulk/work/inputmethod/ibus-hangul/work/ibus-hangul-1.5.0/src'
 .././install-sh -c -d '/pbulk/work/inputmethod/ibus-hangul/work/.destdir/usr/pkg/libexec'
  /bin/sh ../libtool   --mode=install /usr/bin/install -c -s -o pbulk -g users -m 755 ibus-engine-hangul '/pbulk/work/inputmethod/ibus-hangul/work/.destdir/usr/pkg/libexec'
libtool: install: /usr/bin/install -c -o pbulk -g users -m 755 -s ibus-engine-hangul /pbulk/work/inputmethod/ibus-hangul/work/.destdir/usr/pkg/libexec/ibus-engine-hangul
 .././install-sh -c -d '/pbulk/work/inputmethod/ibus-hangul/work/.destdir/usr/pkg/share/ibus/component'
 /usr/bin/install -c -o pbulk -g users -m 644 hangul.xml '/pbulk/work/inputmethod/ibus-hangul/work/.destdir/usr/pkg/share/ibus/component'
gmake[2]: Leaving directory '/pbulk/work/inputmethod/ibus-hangul/work/ibus-hangul-1.5.0/src'
gmake[1]: Leaving directory '/pbulk/work/inputmethod/ibus-hangul/work/ibus-hangul-1.5.0/src'
Making install in setup
gmake[1]: Entering directory '/pbulk/work/inputmethod/ibus-hangul/work/ibus-hangul-1.5.0/setup'
gmake[2]: Entering directory '/pbulk/work/inputmethod/ibus-hangul/work/ibus-hangul-1.5.0/setup'
 .././install-sh -c -d '/pbulk/work/inputmethod/ibus-hangul/work/.destdir/usr/pkg/libexec'
 /usr/bin/install -c -o pbulk -g users -m 755 ibus-setup-hangul '/pbulk/work/inputmethod/ibus-hangul/work/.destdir/usr/pkg/libexec'
/usr/pkg/bin/gmake  install-exec-hook
gmake[3]: Entering directory '/pbulk/work/inputmethod/ibus-hangul/work/ibus-hangul-1.5.0/setup'
.././install-sh -c -d /pbulk/work/inputmethod/ibus-hangul/work/.destdir/usr/pkg/bin
cd /pbulk/work/inputmethod/ibus-hangul/work/.destdir/usr/pkg/bin && \
rm -f ibus-setup-hangul && \
a="/usr/pkg/bin"; b="/usr/pkg/libexec"; updir=""; downdir=""; \
while test "$a" != "$b"; do \
	bbase=`basename $b`; \
	updir="../$updir"; \
	downdir="$bbase/$downdir"; \
	a=`dirname $a`; b=`dirname $b`; \
done; \
ln -s $updir${downdir}ibus-setup-hangul ibus-setup-hangul
gmake[3]: Leaving directory '/pbulk/work/inputmethod/ibus-hangul/work/ibus-hangul-1.5.0/setup'
 .././install-sh -c -d '/pbulk/work/inputmethod/ibus-hangul/work/.destdir/usr/pkg/share/applications'
 /usr/bin/install -c -o pbulk -g users -m 644 ibus-setup-hangul.desktop '/pbulk/work/inputmethod/ibus-hangul/work/.destdir/usr/pkg/share/applications'
 .././install-sh -c -d '/pbulk/work/inputmethod/ibus-hangul/work/.destdir/usr/pkg/share/icons/hicolor/64x64/apps'
 /usr/bin/install -c -o pbulk -g users -m 644 ibus-setup-hangul.png '/pbulk/work/inputmethod/ibus-hangul/work/.destdir/usr/pkg/share/icons/hicolor/64x64/apps'
 .././install-sh -c -d '/pbulk/work/inputmethod/ibus-hangul/work/.destdir/usr/pkg/share/icons/hicolor/scalable/apps'
 /usr/bin/install -c -o pbulk -g users -m 644 ibus-setup-hangul.svg '/pbulk/work/inputmethod/ibus-hangul/work/.destdir/usr/pkg/share/icons/hicolor/scalable/apps'
 .././install-sh -c -d '/pbulk/work/inputmethod/ibus-hangul/work/.destdir/usr/pkg/share/ibus-hangul/setup'
 /usr/bin/install -c -o pbulk -g users -m 644 config.py '/pbulk/work/inputmethod/ibus-hangul/work/.destdir/usr/pkg/share/ibus-hangul/setup'
Traceback (most recent call last):
  File "<string>", line 2, in <module>
ModuleNotFoundError: No module named 'imp'
gmake[2]: *** [Makefile:459: install-nodist_setup_hangulPYTHON] Error 1
gmake[2]: Leaving directory '/pbulk/work/inputmethod/ibus-hangul/work/ibus-hangul-1.5.0/setup'
gmake[1]: *** [Makefile:666: install-am] Error 2
gmake[1]: Leaving directory '/pbulk/work/inputmethod/ibus-hangul/work/ibus-hangul-1.5.0/setup'
gmake: *** [Makefile:490: install-recursive] Error 1
*** Error code 2

Stop.
make[1]: stopped in /usr/pkgsrc/inputmethod/ibus-hangul
*** Error code 1

Stop.
make: stopped in /usr/pkgsrc/inputmethod/ibus-hangul