===> Skipping vulnerability checks.
WARNING: No /usr/pkg/pkgdb/pkg-vulnerabilities file found.
WARNING: To fix run: `/usr/sbin/pkg_admin -K /usr/pkg/pkgdb fetch-pkg-vulnerabilities'.
===> Building for arti-1.4.1
   Compiling proc-macro2 v1.0.93
   Compiling unicode-ident v1.0.17
   Compiling libc v0.2.170
   Compiling cfg-if v1.0.0
   Compiling autocfg v1.4.0
   Compiling version_check v0.9.5
   Compiling pin-project-lite v0.2.16
   Compiling typenum v1.18.0
   Compiling futures-core v0.3.31
   Compiling once_cell v1.20.3
   Compiling futures-io v0.3.31
   Compiling value-bag v1.10.0
   Compiling memchr v2.7.4
   Compiling generic-array v0.14.7
   Compiling serde v1.0.218
   Compiling log v0.4.26
   Compiling slab v0.4.9
   Compiling smallvec v1.14.0
   Compiling shlex v1.3.0
   Compiling itoa v1.0.14
   Compiling futures-sink v0.3.31
   Compiling pin-utils v0.1.0
   Compiling futures-channel v0.3.31
   Compiling futures-task v0.3.31
   Compiling jobserver v0.1.32
   Compiling crossbeam-utils v0.8.21
   Compiling quote v1.0.38
   Compiling cc v1.2.15
   Compiling subtle v2.6.1
   Compiling pkg-config v0.3.31
   Compiling syn v2.0.98
   Compiling getrandom v0.2.15
   Compiling tracing-core v0.1.33
   Compiling syn v1.0.109
   Compiling thiserror v2.0.11
   Compiling heck v0.5.0
   Compiling rustversion v1.0.19
   Compiling lock_api v0.4.12
   Compiling const-oid v0.9.6
   Compiling parking_lot_core v0.9.10
   Compiling bitflags v2.8.0
   Compiling crypto-common v0.1.6
   Compiling scopeguard v1.2.0
   Compiling byteorder v1.5.0
   Compiling bytes v1.10.0
   Compiling block-buffer v0.10.4
   Compiling concurrent-queue v2.5.0
   Compiling parking_lot v0.12.3
   Compiling signal-hook-registry v1.4.2
   Compiling rustix v0.38.44
   Compiling thiserror v1.0.69
   Compiling parking v2.2.1
   Compiling digest v0.10.7
   Compiling rand_core v0.6.4
   Compiling errno v0.3.10
   Compiling stable_deref_trait v1.2.0
   Compiling mio v1.0.3
   Compiling equivalent v1.0.2
   Compiling hashbrown v0.15.2
   Compiling unicode-segmentation v1.12.0
   Compiling vcpkg v0.2.15
   Compiling indexmap v2.7.1
   Compiling convert_case v0.7.1
   Compiling event-listener v5.4.0
   Compiling socket2 v0.5.8
   Compiling num-traits v0.2.19
   Compiling unicode-xid v0.2.6
   Compiling winnow v0.7.3
   Compiling toml_datetime v0.6.8
   Compiling fastrand v2.3.0
   Compiling synstructure v0.13.1
   Compiling event-listener-strategy v0.5.3
   Compiling fnv v1.0.7
   Compiling semver v1.0.25
   Compiling libm v0.2.11
   Compiling ident_case v1.0.1
   Compiling paste v1.0.15
   Compiling litemap v0.7.5
   Compiling writeable v0.5.5
   Compiling num-integer v0.1.46
   Compiling keccak v0.1.5
   Compiling regex-syntax v0.8.5
   Compiling either v1.14.0
   Compiling itertools v0.14.0
   Compiling sha3 v0.10.8
   Compiling toml_edit v0.22.24
   Compiling rustc_version v0.4.1
   Compiling num-bigint v0.4.6
   Compiling openssl-sys v0.9.106
   Compiling regex-automata v0.4.9
   Compiling serde_derive v1.0.218
   Compiling futures-macro v0.3.31
   Compiling tracing-attributes v0.1.28
   Compiling thiserror-impl v2.0.11
   Compiling futures-util v0.3.31
   Compiling zeroize_derive v1.4.2
   Compiling tracing v0.1.41
   Compiling zeroize v1.8.1
   Compiling displaydoc v0.2.5
   Compiling zerofrom-derive v0.1.6
   Compiling yoke-derive v0.7.5
   Compiling thiserror-impl v1.0.69
   Compiling zerocopy-derive v0.7.35
   Compiling zerovec-derive v0.10.3
   Compiling zerofrom v0.1.6
   Compiling zerocopy v0.7.35
   Compiling yoke v0.7.5
   Compiling tokio-macros v2.5.0
   Compiling futures-executor v0.3.31
   Compiling futures v0.3.31
   Compiling derive_more-impl v2.0.1
   Compiling proc-macro-crate v3.2.0
   Compiling strum_macros v0.27.1
   Compiling icu_provider_macros v1.5.0
   Compiling futures-lite v2.6.0
   Compiling tokio v1.43.0
   Compiling zerovec v0.10.4
   Compiling void v1.0.2
   Compiling icu_locid_transform_data v1.5.0
   Compiling ppv-lite86 v0.2.20
   Compiling enum-ordinalize v3.1.15
   Compiling icu_properties_data v1.5.0
   Compiling option-ext v0.2.0
   Compiling static_assertions v1.1.0
   Compiling educe v0.4.23
   Compiling rand_chacha v0.3.1
   Compiling tinystr v0.7.6
   Compiling icu_locid v1.5.0
   Compiling icu_collections v1.5.0
   Compiling polling v3.7.4
   Compiling icu_provider v1.5.0
   Compiling pin-project-internal v1.1.9
   Compiling strum_macros v0.26.4
   Compiling strum v0.27.1
   Compiling icu_locid_transform v1.5.0
   Compiling async-lock v3.4.0
   Compiling ring v0.17.11
   Compiling utf8_iter v1.0.4
   Compiling icu_normalizer_data v1.5.0
   Compiling write16 v1.0.0
   Compiling icu_properties v1.5.1
   Compiling strsim v0.10.0
   Compiling percent-encoding v2.3.1
   Compiling utf16_iter v1.0.5
   Compiling pin-project v1.1.9
   Compiling form_urlencoded v1.2.1
   Compiling darling_core v0.14.4
   Compiling async-io v2.4.0
   Compiling rand v0.8.5
   Compiling strum v0.26.3
   Compiling retry-error v0.6.3 (/pbulk/work/net/arti/work/arti-arti-v1.4.1/crates/retry-error)
   Compiling derive_more v2.0.1
   Compiling atomic-waker v1.1.2
   Compiling foreign-types-shared v0.1.1
   Compiling ryu v1.0.19
   Compiling serde_json v1.0.139
   Compiling icu_normalizer v1.5.0
   Compiling openssl v0.10.71
   Compiling async-task v4.7.1
   Compiling idna_adapter v1.2.0
   Compiling foreign-types v0.3.2
   Compiling tor-error v0.28.0 (/pbulk/work/net/arti/work/arti-arti-v1.4.1/crates/tor-error)
   Compiling piper v0.2.4
   Compiling derive_arbitrary v1.4.1
   Compiling darling_macro v0.14.4
   Compiling openssl-macros v0.1.1
   Compiling async-channel v2.3.1
   Compiling untrusted v0.9.0
   Compiling derive-deftly-macros v1.0.0
   Compiling derive-deftly-macros v0.14.6
   Compiling native-tls v0.2.14
   Compiling base64ct v1.6.0
   Compiling spin v0.9.8
   Compiling blocking v1.6.1
   Compiling darling v0.14.4
   Compiling async-executor v1.13.1
   Compiling lazy_static v1.5.0
   Compiling pem-rfc7468 v0.7.0
   Compiling arbitrary v1.4.1
   Compiling idna v1.0.3
   Compiling async-signal v0.2.10
   Compiling dirs-sys v0.5.0
   Compiling regex v1.11.1
   Compiling ring v0.16.20
   Compiling rustls v0.23.23
   Compiling rustls-pki-types v1.11.0
   Compiling openssl-probe v0.1.6
   Compiling event-listener v2.5.3
   Compiling async-channel v1.9.0
   Compiling tor-general-addr v0.28.0 (/pbulk/work/net/arti/work/arti-arti-v1.4.1/crates/tor-general-addr)
error[E0080]: evaluation of constant value failed
  --> /pbulk/work/net/arti/work/vendor/ring-0.17.11/src/cpu/intel.rs:26:9
   |
26 |         assert!(cfg!(target_feature = "sse") && cfg!(target_feature = "sse2"));
   |         ^^^^^^^^^^^^^^^^^^^^^^^^^^^^^^^^^^^^^^^^^^^^^^^^^^^^^^^^^^^^^^^^^^^^^^ the evaluated program panicked at 'assertion failed: cfg!(target_feature = "sse") && cfg!(target_feature = "sse2")', /pbulk/work/net/arti/work/vendor/ring-0.17.11/src/cpu/intel.rs:26:9
   |
   = note: this error originates in the macro `assert` (in Nightly builds, run with -Z macro-backtrace for more info)

error[E0080]: evaluation of constant value failed
   --> /pbulk/work/net/arti/work/vendor/ring-0.17.11/src/cpu/intel.rs:159:31
    |
159 |     const _SSE_REQUIRED: () = assert!(cfg!(target_feature = "sse"));
    |                               ^^^^^^^^^^^^^^^^^^^^^^^^^^^^^^^^^^^^^ the evaluated program panicked at 'assertion failed: cfg!(target_feature = "sse")', /pbulk/work/net/arti/work/vendor/ring-0.17.11/src/cpu/intel.rs:159:31
    |
    = note: this error originates in the macro `assert` (in Nightly builds, run with -Z macro-backtrace for more info)

error[E0080]: evaluation of constant value failed
   --> /pbulk/work/net/arti/work/vendor/ring-0.17.11/src/cpu/intel.rs:160:32
    |
160 |     const _SSE2_REQUIRED: () = assert!(cfg!(target_feature = "sse2"));
    |                                ^^^^^^^^^^^^^^^^^^^^^^^^^^^^^^^^^^^^^^ the evaluated program panicked at 'assertion failed: cfg!(target_feature = "sse2")', /pbulk/work/net/arti/work/vendor/ring-0.17.11/src/cpu/intel.rs:160:32
    |
    = note: this error originates in the macro `assert` (in Nightly builds, run with -Z macro-backtrace for more info)

   Compiling async-process v2.3.0
   Compiling url v2.5.4
   Compiling async-global-executor v2.4.1
For more information about this error, try `rustc --explain E0080`.
   Compiling derive_builder_core_fork_arti v0.11.2
error: could not compile `ring` (lib) due to 3 previous errors
warning: build failed, waiting for other jobs to finish...
*** Error code 101

Stop.
make[1]: stopped in /usr/pkgsrc/net/arti
*** Error code 1

Stop.
make: stopped in /usr/pkgsrc/net/arti