=> Bootstrap dependency digest>=20211023: found digest-20220214
===> Skipping vulnerability checks.
WARNING: No /usr/pkg/pkgdb/pkg-vulnerabilities file found.
WARNING: To fix run: `/usr/sbin/pkg_admin -K /usr/pkg/pkgdb fetch-pkg-vulnerabilities'.
===> Building for sather-1.2.3nb21
gmake[1]: Entering directory '/pbulk/work/lang/sather/work/sather-1.2.3/System/Common'
Creating Common/CONFIG...
gmake[1]: Leaving directory '/pbulk/work/lang/sather/work/sather-1.2.3/System/Common'

Making serial library: System Socket 
Containers 

Making platform BOOT...
gmake[1]: Entering directory '/pbulk/work/lang/sather/work/sather-1.2.3/System/Platforms/BOOT'
gmake[1]: Nothing to be done for 'all'.
gmake[1]: Leaving directory '/pbulk/work/lang/sather/work/sather-1.2.3/System/Platforms/BOOT'
Making platform linux...
gmake[1]: Entering directory '/pbulk/work/lang/sather/work/sather-1.2.3/System/Platforms/linux'
gmake[1]: Nothing to be done for 'all'.
gmake[1]: Leaving directory '/pbulk/work/lang/sather/work/sather-1.2.3/System/Platforms/linux'

Making boot compiler...

/usr/pkg/bin/gmake -C System/Platforms/netbsd boot CC='gcc'
gmake[1]: Entering directory '/pbulk/work/lang/sather/work/sather-1.2.3/System/Platforms/netbsd'
ln -s `pwd`/header.h ../BOOT
/usr/pkg/bin/gmake -C /pbulk/work/lang/sather/work/sather-1.2.3/Boot/sacomp.code CC=gcc
gmake[2]: Entering directory '/pbulk/work/lang/sather/work/sather-1.2.3/Boot/sacomp.code'
gcc -I. -O2  -I/usr/pkg/include -I/usr/X11R7/include -I/usr/include -I/usr/pkg/include/freetype2 -I../System/Common -I/usr/pkg/include/gc -I/usr/pkg/include -I/usr/X11R7/include -I/usr/include -I/usr/pkg/include/freetype2  -c -o a_stackA_STACK2014955575.o a_stackA_STACK2014955575.c
gcc -I. -O2  -I/usr/pkg/include -I/usr/X11R7/include -I/usr/include -I/usr/pkg/include/freetype2 -I../System/Common -I/usr/pkg/include/gc -I/usr/pkg/include -I/usr/X11R7/include -I/usr/include -I/usr/pkg/include/freetype2  -c -o am_outAM_OUT1363671444.o am_outAM_OUT1363671444.c
gcc -I. -O2  -I/usr/pkg/include -I/usr/X11R7/include -I/usr/include -I/usr/pkg/include/freetype2 -I../System/Common -I/usr/pkg/include/gc -I/usr/pkg/include -I/usr/X11R7/include -I/usr/include -I/usr/pkg/include/freetype2  -c -o am_outAM_OUT1363671444x.o am_outAM_OUT1363671444x.c
gcc -I. -O2  -I/usr/pkg/include -I/usr/X11R7/include -I/usr/include -I/usr/pkg/include/freetype2 -I../System/Common -I/usr/pkg/include/gc -I/usr/pkg/include -I/usr/X11R7/include -I/usr/include -I/usr/pkg/include/freetype2  -c -o arefFSETAM_ROU1518004496.o arefFSETAM_ROU1518004496.c
gcc -I. -O2  -I/usr/pkg/include -I/usr/X11R7/include -I/usr/include -I/usr/pkg/include/freetype2 -I../System/Common -I/usr/pkg/include/gc -I/usr/pkg/include -I/usr/X11R7/include -I/usr/include -I/usr/pkg/include/freetype2  -c -o arefFSETIMMUTA2116029667.o arefFSETIMMUTA2116029667.c
gcc -I. -O2  -I/usr/pkg/include -I/usr/X11R7/include -I/usr/include -I/usr/pkg/include/freetype2 -I../System/Common -I/usr/pkg/include/gc -I/usr/pkg/include -I/usr/X11R7/include -I/usr/include -I/usr/pkg/include/freetype2  -c -o arefFSETTUPSIG268064465.o arefFSETTUPSIG268064465.c
gcc -I. -O2  -I/usr/pkg/include -I/usr/X11R7/include -I/usr/include -I/usr/pkg/include/freetype2 -I../System/Common -I/usr/pkg/include/gc -I/usr/pkg/include -I/usr/X11R7/include -I/usr/include -I/usr/pkg/include/freetype2  -c -o arrayARRAYAM_I1084914261.o arrayARRAYAM_I1084914261.c
gcc -I. -O2  -I/usr/pkg/include -I/usr/X11R7/include -I/usr/include -I/usr/pkg/include/freetype2 -I../System/Common -I/usr/pkg/include/gc -I/usr/pkg/include -I/usr/X11R7/include -I/usr/include -I/usr/pkg/include/freetype2  -c -o arrayARRAYTUPI1927875024.o arrayARRAYTUPI1927875024.c
gcc -I. -O2  -I/usr/pkg/include -I/usr/X11R7/include -I/usr/include -I/usr/pkg/include/freetype2 -I../System/Common -I/usr/pkg/include/gc -I/usr/pkg/include -I/usr/X11R7/include -I/usr/include -I/usr/pkg/include/freetype2  -c -o as_outAS_OUT1429002792.o as_outAS_OUT1429002792.c
gcc -I. -O2  -I/usr/pkg/include -I/usr/X11R7/include -I/usr/include -I/usr/pkg/include/freetype2 -I../System/Common -I/usr/pkg/include/gc -I/usr/pkg/include -I/usr/X11R7/include -I/usr/include -I/usr/pkg/include/freetype2  -c -o as_outAS_OUT1429002792x.o as_outAS_OUT1429002792x.c
gcc -I. -O2  -I/usr/pkg/include -I/usr/X11R7/include -I/usr/include -I/usr/pkg/include/freetype2 -I../System/Common -I/usr/pkg/include/gc -I/usr/pkg/include -I/usr/X11R7/include -I/usr/include -I/usr/pkg/include/freetype2  -c -o cgenCGEN1354269066.o cgenCGEN1354269066.c
gcc -I. -O2  -I/usr/pkg/include -I/usr/X11R7/include -I/usr/include -I/usr/pkg/include/freetype2 -I../System/Common -I/usr/pkg/include/gc -I/usr/pkg/include -I/usr/X11R7/include -I/usr/include -I/usr/pkg/include/freetype2  -c -o cgenCGEN1354269066x.o cgenCGEN1354269066x.c
gcc -I. -O2  -I/usr/pkg/include -I/usr/X11R7/include -I/usr/include -I/usr/pkg/include/freetype2 -I../System/Common -I/usr/pkg/include/gc -I/usr/pkg/include -I/usr/X11R7/include -I/usr/include -I/usr/pkg/include/freetype2  -c -o cgenCGEN1354269066xx.o cgenCGEN1354269066xx.c
gcc -I. -O2  -I/usr/pkg/include -I/usr/X11R7/include -I/usr/include -I/usr/pkg/include/freetype2 -I../System/Common -I/usr/pkg/include/gc -I/usr/pkg/include -I/usr/X11R7/include -I/usr/include -I/usr/pkg/include/freetype2  -c -o cgenCGEN1354269066xxx.o cgenCGEN1354269066xxx.c
gcc -I. -O2  -I/usr/pkg/include -I/usr/X11R7/include -I/usr/include -I/usr/pkg/include/freetype2 -I../System/Common -I/usr/pkg/include/gc -I/usr/pkg/include -I/usr/X11R7/include -I/usr/include -I/usr/pkg/include/freetype2  -c -o cgenCGEN1354269066xxxx.o cgenCGEN1354269066xxxx.c
gcc -I. -O2  -I/usr/pkg/include -I/usr/X11R7/include -I/usr/include -I/usr/pkg/include/freetype2 -I../System/Common -I/usr/pkg/include/gc -I/usr/pkg/include -I/usr/X11R7/include -I/usr/include -I/usr/pkg/include/freetype2  -c -o cgenCGEN1354269066xxxxx.o cgenCGEN1354269066xxxxx.c
gcc -I. -O2  -I/usr/pkg/include -I/usr/X11R7/include -I/usr/include -I/usr/pkg/include/freetype2 -I../System/Common -I/usr/pkg/include/gc -I/usr/pkg/include -I/usr/X11R7/include -I/usr/include -I/usr/pkg/include/freetype2  -c -o cgenCGEN1354269066xxxxxx.o cgenCGEN1354269066xxxxxx.c
gcc -I. -O2  -I/usr/pkg/include -I/usr/X11R7/include -I/usr/include -I/usr/pkg/include/freetype2 -I../System/Common -I/usr/pkg/include/gc -I/usr/pkg/include -I/usr/X11R7/include -I/usr/include -I/usr/pkg/include/freetype2  -c -o cgenCGEN1354269066xxxxxxx.o cgenCGEN1354269066xxxxxxx.c
gcc -I. -O2  -I/usr/pkg/include -I/usr/X11R7/include -I/usr/include -I/usr/pkg/include/freetype2 -I../System/Common -I/usr/pkg/include/gc -I/usr/pkg/include -I/usr/X11R7/include -I/usr/include -I/usr/pkg/include/freetype2  -c -o cgenCGEN1354269066xxxxxxxx.o cgenCGEN1354269066xxxxxxxx.c
gcc -I. -O2  -I/usr/pkg/include -I/usr/X11R7/include -I/usr/include -I/usr/pkg/include/freetype2 -I../System/Common -I/usr/pkg/include/gc -I/usr/pkg/include -I/usr/X11R7/include -I/usr/include -I/usr/pkg/include/freetype2  -c -o cgenCGEN1354269066xxxxxxxxx.o cgenCGEN1354269066xxxxxxxxx.c
gcc -I. -O2  -I/usr/pkg/include -I/usr/X11R7/include -I/usr/include -I/usr/pkg/include/freetype2 -I../System/Common -I/usr/pkg/include/gc -I/usr/pkg/include -I/usr/X11R7/include -I/usr/include -I/usr/pkg/include/freetype2  -c -o cgenCGEN1354269066xxxxxxxxxx.o cgenCGEN1354269066xxxxxxxxxx.c
gcc -I. -O2  -I/usr/pkg/include -I/usr/X11R7/include -I/usr/include -I/usr/pkg/include/freetype2 -I../System/Common -I/usr/pkg/include/gc -I/usr/pkg/include -I/usr/X11R7/include -I/usr/include -I/usr/pkg/include/freetype2  -c -o code_fileCODE_372141741.o code_fileCODE_372141741.c
code_fileCODE_372141741.c: In function 'CODE_F1479352172':
code_fileCODE_372141741.c:5616:2: warning: implicit declaration of function 'mkdir' [-Wimplicit-function-declaration]
 5616 |  mkdir(((L1==NULL)?NULL:L1->arr_part), 511);
      |  ^~~~~
code_fileCODE_372141741.c: In function 'CODE_F423548741':
code_fileCODE_372141741.c:7594:3: warning: 'return' with no value, in function returning non-void
 7594 |   return;
      |   ^~~~~~
code_fileCODE_372141741.c:7485:5: note: declared here
 7485 | STR CODE_F423548741(CODE_F423548741_frame frame) {
      |     ^~~~~~~~~~~~~~~
code_fileCODE_372141741.c:7698:3: warning: 'return' with no value, in function returning non-void
 7698 |   return;
      |   ^~~~~~
code_fileCODE_372141741.c:7485:5: note: declared here
 7485 | STR CODE_F423548741(CODE_F423548741_frame frame) {
      |     ^~~~~~~~~~~~~~~
gcc -I. -O2  -I/usr/pkg/include -I/usr/X11R7/include -I/usr/include -I/usr/pkg/include/freetype2 -I../System/Common -I/usr/pkg/include/gc -I/usr/pkg/include -I/usr/X11R7/include -I/usr/include -I/usr/pkg/include/freetype2  -c -o configCONFIG_R422014871.o configCONFIG_R422014871.c
configCONFIG_R422014871.c: In function 'CONFIG1589956977':
configCONFIG_R422014871.c:7267:4: warning: 'return' with no value, in function returning non-void
 7267 |    return;
      |    ^~~~~~
configCONFIG_R422014871.c:7239:10: note: declared here
 7239 | FLISTSTR CONFIG1589956977(CONFIG1589956977_frame frame) {
      |          ^~~~~~~~~~~~~~~~
configCONFIG_R422014871.c: In function 'CONFIG875430285':
configCONFIG_R422014871.c:7345:4: warning: 'return' with no value, in function returning non-void
 7345 |    return;
      |    ^~~~~~
configCONFIG_R422014871.c:7286:5: note: declared here
 7286 | STR CONFIG875430285(CONFIG875430285_frame frame) {
      |     ^~~~~~~~~~~~~~~
gcc -I. -O2  -I/usr/pkg/include -I/usr/X11R7/include -I/usr/include -I/usr/pkg/include/freetype2 -I../System/Common -I/usr/pkg/include/gc -I/usr/pkg/include -I/usr/X11R7/include -I/usr/include -I/usr/pkg/include/freetype2  -c -o cs_optionsCS_O301318552.o cs_optionsCS_O301318552.c
gcc -I. -O2  -I/usr/pkg/include -I/usr/X11R7/include -I/usr/include -I/usr/pkg/include/freetype2 -I../System/Common -I/usr/pkg/include/gc -I/usr/pkg/include -I/usr/X11R7/include -I/usr/include -I/usr/pkg/include/freetype2  -c -o cs_optionsCS_O301318552x.o cs_optionsCS_O301318552x.c
gcc -I. -O2  -I/usr/pkg/include -I/usr/X11R7/include -I/usr/include -I/usr/pkg/include/freetype2 -I../System/Common -I/usr/pkg/include/gc -I/usr/pkg/include -I/usr/X11R7/include -I/usr/include -I/usr/pkg/include/freetype2  -c -o cursorAM_CURSO1314676474.o cursorAM_CURSO1314676474.c
gcc -I. -O2  -I/usr/pkg/include -I/usr/X11R7/include -I/usr/include -I/usr/pkg/include/freetype2 -I../System/Common -I/usr/pkg/include/gc -I/usr/pkg/include -I/usr/X11R7/include -I/usr/include -I/usr/pkg/include/freetype2  -c -o cursorAM_CURSO1314676474x.o cursorAM_CURSO1314676474x.c
cursorAM_CURSO1314676474x.c: In function 'AM_CUR1040670508':
cursorAM_CURSO1314676474x.c:6773:4: warning: 'return' with no value, in function returning non-void
 6773 |    return;
      |    ^~~~~~
cursorAM_CURSO1314676474x.c:6753:5: note: declared here
 6753 | dAM AM_CUR1040670508(AM_CUR1040670508_frame frame) {
      |     ^~~~~~~~~~~~~~~~
gcc -I. -O2  -I/usr/pkg/include -I/usr/X11R7/include -I/usr/include -I/usr/pkg/include/freetype2 -I../System/Common -I/usr/pkg/include/gc -I/usr/pkg/include -I/usr/X11R7/include -I/usr/include -I/usr/pkg/include/freetype2  -c -o cursorAM_CURSO1314676474xx.o cursorAM_CURSO1314676474xx.c
gcc -I. -O2  -I/usr/pkg/include -I/usr/X11R7/include -I/usr/include -I/usr/pkg/include/freetype2 -I../System/Common -I/usr/pkg/include/gc -I/usr/pkg/include -I/usr/X11R7/include -I/usr/include -I/usr/pkg/include/freetype2  -c -o cursorAM_CURSO1314676474xxx.o cursorAM_CURSO1314676474xxx.c
gcc -I. -O2  -I/usr/pkg/include -I/usr/X11R7/include -I/usr/include -I/usr/pkg/include/freetype2 -I../System/Common -I/usr/pkg/include/gc -I/usr/pkg/include -I/usr/X11R7/include -I/usr/include -I/usr/pkg/include/freetype2  -c -o dispatch.o dispatch.c
gcc -I. -O2  -I/usr/pkg/include -I/usr/X11R7/include -I/usr/include -I/usr/pkg/include/freetype2 -I../System/Common -I/usr/pkg/include/gc -I/usr/pkg/include -I/usr/X11R7/include -I/usr/include -I/usr/pkg/include/freetype2  -c -o eltELT742463773.o eltELT742463773.c
gcc -I. -O2  -I/usr/pkg/include -I/usr/X11R7/include -I/usr/include -I/usr/pkg/include/freetype2 -I../System/Common -I/usr/pkg/include/gc -I/usr/pkg/include -I/usr/X11R7/include -I/usr/include -I/usr/pkg/include/freetype2  -c -o elt_algELT_ALG1548486913.o elt_algELT_ALG1548486913.c
gcc -I. -O2  -I/usr/pkg/include -I/usr/X11R7/include -I/usr/include -I/usr/pkg/include/freetype2 -I../System/Common -I/usr/pkg/include/gc -I/usr/pkg/include -I/usr/X11R7/include -I/usr/include -I/usr/pkg/include/freetype2  -c -o elt_algELT_ALG241706736.o elt_algELT_ALG241706736.c
gcc -I. -O2  -I/usr/pkg/include -I/usr/X11R7/include -I/usr/include -I/usr/pkg/include/freetype2 -I../System/Common -I/usr/pkg/include/gc -I/usr/pkg/include -I/usr/X11R7/include -I/usr/include -I/usr/pkg/include/freetype2  -c -o elt_algELT_ALG433952755.o elt_algELT_ALG433952755.c
gcc -I. -O2  -I/usr/pkg/include -I/usr/X11R7/include -I/usr/include -I/usr/pkg/include/freetype2 -I../System/Common -I/usr/pkg/include/gc -I/usr/pkg/include -I/usr/X11R7/include -I/usr/include -I/usr/pkg/include/freetype2  -c -o elt_algELT_ALG656599769.o elt_algELT_ALG656599769.c
gcc -I. -O2  -I/usr/pkg/include -I/usr/X11R7/include -I/usr/include -I/usr/pkg/include/freetype2 -I../System/Common -I/usr/pkg/include/gc -I/usr/pkg/include -I/usr/X11R7/include -I/usr/include -I/usr/pkg/include/freetype2  -c -o elt_algELT_ALG987448979.o elt_algELT_ALG987448979.c
gcc -I. -O2  -I/usr/pkg/include -I/usr/X11R7/include -I/usr/include -I/usr/pkg/include/freetype2 -I../System/Common -I/usr/pkg/include/gc -I/usr/pkg/include -I/usr/X11R7/include -I/usr/include -I/usr/pkg/include/freetype2  -c -o flistFLISTAM_C1171004157.o flistFLISTAM_C1171004157.c
gcc -I. -O2  -I/usr/pkg/include -I/usr/X11R7/include -I/usr/include -I/usr/pkg/include/freetype2 -I../System/Common -I/usr/pkg/include/gc -I/usr/pkg/include -I/usr/X11R7/include -I/usr/include -I/usr/pkg/include/freetype2  -c -o flistFLISTTUPA253333040.o flistFLISTTUPA253333040.c
In file included from ../../System/Platforms/BOOT/../../Common/c_header.h:239,
                 from ../../System/Platforms/BOOT/header.h:8,
                 from sather.h:4,
                 from flistFLISTTUPA253333040.c:1:
flistFLISTTUPA253333040.c: In function 'r_signaling_nan':
flistFLISTTUPA253333040.c:1832:9: warning: implicit declaration of function 'signaling_nan'; did you mean 'r_signaling_nan'? [-Wimplicit-function-declaration]
 1832 | _FM_F_I(signaling_nan)
      |         ^~~~~~~~~~~~~
../../System/Platforms/BOOT/../../Common/floatmath.h:110:60: note: in definition of macro '_FM_F_I'
  110 | #define _FM_F_I(name)  static FLT r_##name(INT i) { return name(i); }
      |                                                            ^~~~
gcc -I. -O2  -I/usr/pkg/include -I/usr/X11R7/include -I/usr/include -I/usr/pkg/include/freetype2 -I../System/Common -I/usr/pkg/include/gc -I/usr/pkg/include -I/usr/X11R7/include -I/usr/include -I/usr/pkg/include/freetype2  -c -o fmapFMAPAM_ROU1000508936.o fmapFMAPAM_ROU1000508936.c
gcc -I. -O2  -I/usr/pkg/include -I/usr/X11R7/include -I/usr/include -I/usr/pkg/include/freetype2 -I../System/Common -I/usr/pkg/include/gc -I/usr/pkg/include -I/usr/X11R7/include -I/usr/include -I/usr/pkg/include/freetype2  -c -o fmapFMAPSTRFSE258056667.o fmapFMAPSTRFSE258056667.c
gcc -I. -O2  -I/usr/pkg/include -I/usr/X11R7/include -I/usr/include -I/usr/pkg/include/freetype2 -I../System/Common -I/usr/pkg/include/gc -I/usr/pkg/include -I/usr/X11R7/include -I/usr/include -I/usr/pkg/include/freetype2  -c -o fmapFMAPdTPCOD1051074108.o fmapFMAPdTPCOD1051074108.c
fmapFMAPdTPCOD1051074108.c: In function 'ELT_TB431570775':
fmapFMAPdTPCOD1051074108.c:6402:3: warning: 'return' with no value, in function returning non-void
 6402 |   return;
      |   ^~~~~~
fmapFMAPdTPCOD1051074108.c:6372:5: note: declared here
 6372 | ELT ELT_TB431570775(ELT_TB431570775_frame frame) {
      |     ^~~~~~~~~~~~~~~
fmapFMAPdTPCOD1051074108.c: In function 'SIG_TB788365833':
fmapFMAPdTPCOD1051074108.c:6814:3: warning: 'return' with no value, in function returning non-void
 6814 |   return;
      |   ^~~~~~
fmapFMAPdTPCOD1051074108.c:6784:5: note: declared here
 6784 | SIG SIG_TB788365833(SIG_TB788365833_frame frame) {
      |     ^~~~~~~~~~~~~~~
gcc -I. -O2  -I/usr/pkg/include -I/usr/X11R7/include -I/usr/include -I/usr/pkg/include/freetype2 -I../System/Common -I/usr/pkg/include/gc -I/usr/pkg/include -I/usr/X11R7/include -I/usr/include -I/usr/pkg/include/freetype2  -c -o generate_amGEN60284023.o generate_amGEN60284023.c
gcc -I. -O2  -I/usr/pkg/include -I/usr/X11R7/include -I/usr/include -I/usr/pkg/include/freetype2 -I../System/Common -I/usr/pkg/include/gc -I/usr/pkg/include -I/usr/X11R7/include -I/usr/include -I/usr/pkg/include/freetype2  -c -o get_optionsCOD183550016.o get_optionsCOD183550016.c
gcc -I. -O2  -I/usr/pkg/include -I/usr/X11R7/include -I/usr/include -I/usr/pkg/include/freetype2 -I../System/Common -I/usr/pkg/include/gc -I/usr/pkg/include -I/usr/X11R7/include -I/usr/include -I/usr/pkg/include/freetype2  -c -o globals.o globals.c
gcc -I. -O2  -I/usr/pkg/include -I/usr/X11R7/include -I/usr/include -I/usr/pkg/include/freetype2 -I../System/Common -I/usr/pkg/include/gc -I/usr/pkg/include -I/usr/X11R7/include -I/usr/include -I/usr/pkg/include/freetype2  -c -o get_optionsCOD183550016x.o get_optionsCOD183550016x.c
gcc -I. -O2  -I/usr/pkg/include -I/usr/X11R7/include -I/usr/include -I/usr/pkg/include/freetype2 -I../System/Common -I/usr/pkg/include/gc -I/usr/pkg/include -I/usr/X11R7/include -I/usr/include -I/usr/pkg/include/freetype2  -c -o implIMPL_CREAT99472218.o implIMPL_CREAT99472218.c
gcc -I. -O2  -I/usr/pkg/include -I/usr/X11R7/include -I/usr/include -I/usr/pkg/include/freetype2 -I../System/Common -I/usr/pkg/include/gc -I/usr/pkg/include -I/usr/X11R7/include -I/usr/include -I/usr/pkg/include/freetype2  -c -o inlineINLINE_I1557365391.o inlineINLINE_I1557365391.c
gcc -I. -O2  -I/usr/pkg/include -I/usr/X11R7/include -I/usr/include -I/usr/pkg/include/freetype2 -I../System/Common -I/usr/pkg/include/gc -I/usr/pkg/include -I/usr/X11R7/include -I/usr/include -I/usr/pkg/include/freetype2  -c -o intiINTI1462257232.o intiINTI1462257232.c
gcc -I. -O2  -I/usr/pkg/include -I/usr/X11R7/include -I/usr/include -I/usr/pkg/include/freetype2 -I../System/Common -I/usr/pkg/include/gc -I/usr/pkg/include -I/usr/X11R7/include -I/usr/include -I/usr/pkg/include/freetype2  -c -o layoutCLASS_LA1330944056.o layoutCLASS_LA1330944056.c
gcc -I. -O2  -I/usr/pkg/include -I/usr/X11R7/include -I/usr/include -I/usr/pkg/include/freetype2 -I../System/Common -I/usr/pkg/include/gc -I/usr/pkg/include -I/usr/X11R7/include -I/usr/include -I/usr/pkg/include/freetype2  -c -o mangleMANGLE1705139666.o mangleMANGLE1705139666.c
gcc -I. -O2  -I/usr/pkg/include -I/usr/X11R7/include -I/usr/include -I/usr/pkg/include/freetype2 -I../System/Common -I/usr/pkg/include/gc -I/usr/pkg/include -I/usr/X11R7/include -I/usr/include -I/usr/pkg/include/freetype2  -c -o mangleNAMESPAC760510184.o mangleNAMESPAC760510184.c
gcc -I. -O2  -I/usr/pkg/include -I/usr/X11R7/include -I/usr/include -I/usr/pkg/include/freetype2 -I../System/Common -I/usr/pkg/include/gc -I/usr/pkg/include -I/usr/X11R7/include -I/usr/include -I/usr/pkg/include/freetype2  -c -o o_localOPT_LOC907909712.o o_localOPT_LOC907909712.c
gcc -I. -O2  -I/usr/pkg/include -I/usr/X11R7/include -I/usr/include -I/usr/pkg/include/freetype2 -I../System/Common -I/usr/pkg/include/gc -I/usr/pkg/include -I/usr/X11R7/include -I/usr/include -I/usr/pkg/include/freetype2  -c -o o_localOPT_LOC907909712x.o o_localOPT_LOC907909712x.c
gcc -I. -O2  -I/usr/pkg/include -I/usr/X11R7/include -I/usr/include -I/usr/pkg/include/freetype2 -I../System/Common -I/usr/pkg/include/gc -I/usr/pkg/include -I/usr/X11R7/include -I/usr/include -I/usr/pkg/include/freetype2  -c -o optimizeOPT_CO1177876774.o optimizeOPT_CO1177876774.c
gcc -I. -O2  -I/usr/pkg/include -I/usr/X11R7/include -I/usr/include -I/usr/pkg/include/freetype2 -I../System/Common -I/usr/pkg/include/gc -I/usr/pkg/include -I/usr/X11R7/include -I/usr/include -I/usr/pkg/include/freetype2  -c -o optimizeOPT_IT1193060919.o optimizeOPT_IT1193060919.c
gcc -I. -O2  -I/usr/pkg/include -I/usr/X11R7/include -I/usr/include -I/usr/pkg/include/freetype2 -I../System/Common -I/usr/pkg/include/gc -I/usr/pkg/include -I/usr/X11R7/include -I/usr/include -I/usr/pkg/include/freetype2  -c -o parsePARSER311504339.o parsePARSER311504339.c
gcc -I. -O2  -I/usr/pkg/include -I/usr/X11R7/include -I/usr/include -I/usr/pkg/include/freetype2 -I../System/Common -I/usr/pkg/include/gc -I/usr/pkg/include -I/usr/X11R7/include -I/usr/include -I/usr/pkg/include/freetype2  -c -o parsePARSER311504339x.o parsePARSER311504339x.c
gcc -I. -O2  -I/usr/pkg/include -I/usr/X11R7/include -I/usr/include -I/usr/pkg/include/freetype2 -I../System/Common -I/usr/pkg/include/gc -I/usr/pkg/include -I/usr/X11R7/include -I/usr/include -I/usr/pkg/include/freetype2  -c -o parsePARSER311504339xx.o parsePARSER311504339xx.c
gcc -I. -O2  -I/usr/pkg/include -I/usr/X11R7/include -I/usr/include -I/usr/pkg/include/freetype2 -I../System/Common -I/usr/pkg/include/gc -I/usr/pkg/include -I/usr/X11R7/include -I/usr/include -I/usr/pkg/include/freetype2  -c -o parsePARSER311504339xxx.o parsePARSER311504339xxx.c
gcc -I. -O2  -I/usr/pkg/include -I/usr/X11R7/include -I/usr/include -I/usr/pkg/include/freetype2 -I../System/Common -I/usr/pkg/include/gc -I/usr/pkg/include -I/usr/X11R7/include -I/usr/include -I/usr/pkg/include/freetype2  -c -o parsePARSER311504339xxxx.o parsePARSER311504339xxxx.c
gcc -I. -O2  -I/usr/pkg/include -I/usr/X11R7/include -I/usr/include -I/usr/pkg/include/freetype2 -I../System/Common -I/usr/pkg/include/gc -I/usr/pkg/include -I/usr/X11R7/include -I/usr/include -I/usr/pkg/include/freetype2  -c -o progPROG_AS_TB824135997.o progPROG_AS_TB824135997.c
gcc -I. -O2  -I/usr/pkg/include -I/usr/X11R7/include -I/usr/include -I/usr/pkg/include/freetype2 -I../System/Common -I/usr/pkg/include/gc -I/usr/pkg/include -I/usr/X11R7/include -I/usr/include -I/usr/pkg/include/freetype2  -c -o scanSCANNER1990933774.o scanSCANNER1990933774.c
gcc -I. -O2  -I/usr/pkg/include -I/usr/X11R7/include -I/usr/include -I/usr/pkg/include/freetype2 -I../System/Common -I/usr/pkg/include/gc -I/usr/pkg/include -I/usr/X11R7/include -I/usr/include -I/usr/pkg/include/freetype2  -c -o side_effectSE_411721069.o side_effectSE_411721069.c
gcc -I. -O2  -I/usr/pkg/include -I/usr/X11R7/include -I/usr/include -I/usr/pkg/include/freetype2 -I../System/Common -I/usr/pkg/include/gc -I/usr/pkg/include -I/usr/X11R7/include -I/usr/include -I/usr/pkg/include/freetype2  -c -o strings.o strings.c
gcc -I. -O2  -I/usr/pkg/include -I/usr/X11R7/include -I/usr/include -I/usr/pkg/include/freetype2 -I../System/Common -I/usr/pkg/include/gc -I/usr/pkg/include -I/usr/X11R7/include -I/usr/include -I/usr/pkg/include/freetype2  -c -o stringsx.o stringsx.c
gcc -I. -O2  -I/usr/pkg/include -I/usr/X11R7/include -I/usr/include -I/usr/pkg/include/freetype2 -I../System/Common -I/usr/pkg/include/gc -I/usr/pkg/include -I/usr/X11R7/include -I/usr/include -I/usr/pkg/include/freetype2  -c -o stringsxx.o stringsxx.c
gcc -I. -O2  -I/usr/pkg/include -I/usr/X11R7/include -I/usr/include -I/usr/pkg/include/freetype2 -I../System/Common -I/usr/pkg/include/gc -I/usr/pkg/include -I/usr/X11R7/include -I/usr/include -I/usr/pkg/include/freetype2  -c -o system.o system.c
gcc -I. -O2  -I/usr/pkg/include -I/usr/X11R7/include -I/usr/include -I/usr/pkg/include/freetype2 -I../System/Common -I/usr/pkg/include/gc -I/usr/pkg/include -I/usr/X11R7/include -I/usr/include -I/usr/pkg/include/freetype2  -c -o stmtAM_FORK_ST1674905658.o stmtAM_FORK_ST1674905658.c
stmtAM_FORK_ST1674905658.c: In function 'STR_sp663650766':
stmtAM_FORK_ST1674905658.c:6698:3: warning: 'return' with no value, in function returning non-void
 6698 |   return;
      |   ^~~~~~
stmtAM_FORK_ST1674905658.c:6673:5: note: declared here
 6673 | STR STR_sp663650766(STR_sp663650766_frame frame) {
      |     ^~~~~~~~~~~~~~~
stmtAM_FORK_ST1674905658.c: In function 'SYSTEM675309847':
stmtAM_FORK_ST1674905658.c:6754:4: warning: 'return' with no value, in function returning non-void
 6754 |    return;
      |    ^~~~~~
stmtAM_FORK_ST1674905658.c:6743:5: note: declared here
 6743 | STR SYSTEM675309847(SYSTEM675309847_frame frame) {
      |     ^~~~~~~~~~~~~~~
stmtAM_FORK_ST1674905658.c: In function 'AS_STM1504735434':
stmtAM_FORK_ST1674905658.c:6855:3: warning: 'return' with no value, in function returning non-void
 6855 |   return;
      |   ^~~~~~
stmtAM_FORK_ST1674905658.c:6771:10: note: declared here
 6771 | dAS_STMT AS_STM1504735434(AS_STM1504735434_frame frame) {
      |          ^~~~~~~~~~~~~~~~
gcc -I. -O2  -I/usr/pkg/include -I/usr/X11R7/include -I/usr/include -I/usr/pkg/include/freetype2 -I../System/Common -I/usr/pkg/include/gc -I/usr/pkg/include -I/usr/X11R7/include -I/usr/include -I/usr/pkg/include/freetype2  -c -o tpTP_BUILTIN1142074570.o tpTP_BUILTIN1142074570.c
gcc -I. -O2  -I/usr/pkg/include -I/usr/X11R7/include -I/usr/include -I/usr/pkg/include/freetype2 -I../System/Common -I/usr/pkg/include/gc -I/usr/pkg/include -I/usr/X11R7/include -I/usr/include -I/usr/pkg/include/freetype2  -c -o tpTP_ITER145455607.o tpTP_ITER145455607.c
gcc -I. -O2  -I/usr/pkg/include -I/usr/X11R7/include -I/usr/include -I/usr/pkg/include/freetype2 -I../System/Common -I/usr/pkg/include/gc -I/usr/pkg/include -I/usr/X11R7/include -I/usr/include -I/usr/pkg/include/freetype2  -c -o transTRANS2123847391.o transTRANS2123847391.c
gcc -I. -O2  -I/usr/pkg/include -I/usr/X11R7/include -I/usr/include -I/usr/pkg/include/freetype2 -I../System/Common -I/usr/pkg/include/gc -I/usr/pkg/include -I/usr/X11R7/include -I/usr/include -I/usr/pkg/include/freetype2  -c -o transTRANS2123847391x.o transTRANS2123847391x.c
gcc -I. -O2  -I/usr/pkg/include -I/usr/X11R7/include -I/usr/include -I/usr/pkg/include/freetype2 -I../System/Common -I/usr/pkg/include/gc -I/usr/pkg/include -I/usr/X11R7/include -I/usr/include -I/usr/pkg/include/freetype2  -c -o transTRANS2123847391xx.o transTRANS2123847391xx.c
gcc -I. -O2  -I/usr/pkg/include -I/usr/X11R7/include -I/usr/include -I/usr/pkg/include/freetype2 -I../System/Common -I/usr/pkg/include/gc -I/usr/pkg/include -I/usr/X11R7/include -I/usr/include -I/usr/pkg/include/freetype2  -c -o transTRANS2123847391xxx.o transTRANS2123847391xxx.c
transTRANS2123847391xxx.c: In function 'TRANS_1349638895':
transTRANS2123847391xxx.c:7422:3: warning: 'return' with no value, in function returning non-void
 7422 |   return;
      |   ^~~~~~
transTRANS2123847391xxx.c:7396:15: note: declared here
 7396 | AM_LOCAL_EXPR TRANS_1349638895(TRANS_1349638895_frame frame) {
      |               ^~~~~~~~~~~~~~~~
gcc -I. -O2  -I/usr/pkg/include -I/usr/X11R7/include -I/usr/include -I/usr/pkg/include/freetype2 -I../System/Common -I/usr/pkg/include/gc -I/usr/pkg/include -I/usr/X11R7/include -I/usr/include -I/usr/pkg/include/freetype2  -c -o transTRANS2123847391xxxx.o transTRANS2123847391xxxx.c
gcc -I. -O2  -I/usr/pkg/include -I/usr/X11R7/include -I/usr/include -I/usr/pkg/include/freetype2 -I../System/Common -I/usr/pkg/include/gc -I/usr/pkg/include -I/usr/X11R7/include -I/usr/include -I/usr/pkg/include/freetype2  -c -o tupTUPAM_CURSO1313579705.o tupTUPAM_CURSO1313579705.c
gcc -I. -O2  -I/usr/pkg/include -I/usr/X11R7/include -I/usr/include -I/usr/pkg/include/freetype2 -I../System/Common -I/usr/pkg/include/gc -I/usr/pkg/include -I/usr/X11R7/include -I/usr/include -I/usr/pkg/include/freetype2  -c -o unbox.o unbox.c
gcc -I. -O2  -I/usr/pkg/include -I/usr/X11R7/include -I/usr/include -I/usr/pkg/include/freetype2 -I../System/Common -I/usr/pkg/include/gc -I/usr/pkg/include -I/usr/X11R7/include -I/usr/include -I/usr/pkg/include/freetype2  -c -o unixUNIX1766692.o unixUNIX1766692.c
gcc -I. -O2  -I/usr/pkg/include -I/usr/X11R7/include -I/usr/include -I/usr/pkg/include/freetype2 -I../System/Common -I/usr/pkg/include/gc -c ../../System/Common/runtime.c
gcc -I. -O2  -I/usr/pkg/include -I/usr/X11R7/include -I/usr/include -I/usr/pkg/include/freetype2 -I../System/Common -I/usr/pkg/include/gc -o ../sacomp a_stackA_STACK2014955575.o am_outAM_OUT1363671444.o am_outAM_OUT1363671444x.o arefFSETAM_ROU1518004496.o arefFSETIMMUTA2116029667.o arefFSETTUPSIG268064465.o arrayARRAYAM_I1084914261.o arrayARRAYTUPI1927875024.o as_outAS_OUT1429002792.o as_outAS_OUT1429002792x.o cgenCGEN1354269066.o cgenCGEN1354269066x.o cgenCGEN1354269066xx.o cgenCGEN1354269066xxx.o cgenCGEN1354269066xxxx.o cgenCGEN1354269066xxxxx.o cgenCGEN1354269066xxxxxx.o cgenCGEN1354269066xxxxxxx.o cgenCGEN1354269066xxxxxxxx.o cgenCGEN1354269066xxxxxxxxx.o cgenCGEN1354269066xxxxxxxxxx.o code_fileCODE_372141741.o configCONFIG_R422014871.o cs_optionsCS_O301318552.o cs_optionsCS_O301318552x.o cursorAM_CURSO1314676474.o cursorAM_CURSO1314676474x.o cursorAM_CURSO1314676474xx.o cursorAM_CURSO1314676474xxx.o dispatch.o eltELT742463773.o elt_algELT_ALG1548486913.o elt_algELT_ALG241706736.o elt_algELT_ALG433952755.o elt_algELT_ALG656599769.o elt_algELT_ALG987448979.o flistFLISTAM_C1171004157.o flistFLISTTUPA253333040.o fmapFMAPAM_ROU1000508936.o fmapFMAPSTRFSE258056667.o fmapFMAPdTPCOD1051074108.o generate_amGEN60284023.o get_optionsCOD183550016.o globals.o get_optionsCOD183550016x.o implIMPL_CREAT99472218.o inlineINLINE_I1557365391.o intiINTI1462257232.o layoutCLASS_LA1330944056.o mangleMANGLE1705139666.o mangleNAMESPAC760510184.o o_localOPT_LOC907909712.o o_localOPT_LOC907909712x.o optimizeOPT_CO1177876774.o optimizeOPT_IT1193060919.o parsePARSER311504339.o parsePARSER311504339x.o parsePARSER311504339xx.o parsePARSER311504339xxx.o parsePARSER311504339xxxx.o progPROG_AS_TB824135997.o scanSCANNER1990933774.o side_effectSE_411721069.o strings.o stringsx.o stringsxx.o system.o stmtAM_FORK_ST1674905658.o tpTP_BUILTIN1142074570.o tpTP_ITER145455607.o transTRANS2123847391.o transTRANS2123847391x.o transTRANS2123847391xx.o transTRANS2123847391xxx.o transTRANS2123847391xxxx.o tupTUPAM_CURSO1313579705.o unbox.o unixUNIX1766692.o runtime.o  -L/usr/pkg/lib -Wl,-R/usr/pkg/lib -lgc -lm
gmake[2]: Leaving directory '/pbulk/work/lang/sather/work/sather-1.2.3/Boot/sacomp.code'
rm -f ../BOOT/header.h
gmake[1]: Leaving directory '/pbulk/work/lang/sather/work/sather-1.2.3/System/Platforms/netbsd'

Creating C for installation compiler...

Boot/sacomp     -verbose -O_fast -O_no_move_while -O_no_hoist_const -O_no_cse -only_reachable Compiler/sacomp.module -o Bin/sacomp -only_C
Initializing... (0 seconds)
Parsing non-library files... (0 seconds)
Finding types and parsing library... (0 seconds)
Type graph, conformance, main, init... (0 seconds)
Type check, generate, inline, optimize, and make C... (1 seconds)
Headers, writing C files... Regenerated 84 of 84 files... (1 seconds)
Compilation complete.

Compiling C for installation compiler...

/usr/pkg/bin/gmake -C Bin/sacomp.code
gmake[1]: Entering directory '/pbulk/work/lang/sather/work/sather-1.2.3/Bin/sacomp.code'
gcc -I/usr/X11R7/include -I/usr/pkg/include/gc -L/usr/pkg/lib -Wl,-R/usr/pkg/lib -I/usr/pkg/include -I/usr/pkg/include -Wl,-R/usr/X11R7/lib -L/usr/X11R7/lib -Wl,-R/usr/pkg/lib -L/usr/pkg/lib -Wl,-R/usr/pkg/lib -L/usr/pkg/lib -I.  -O2  -I/pbulk/work/lang/sather/work/sather-1.2.3/System/Common -I/usr/pkg/include -I/usr/X11R7/include -I/usr/include -I/usr/pkg/include/freetype2  -c -o a_stackA_STACK2014955575.o a_stackA_STACK2014955575.c
gcc -I/usr/X11R7/include -I/usr/pkg/include/gc -L/usr/pkg/lib -Wl,-R/usr/pkg/lib -I/usr/pkg/include -I/usr/pkg/include -Wl,-R/usr/X11R7/lib -L/usr/X11R7/lib -Wl,-R/usr/pkg/lib -L/usr/pkg/lib -Wl,-R/usr/pkg/lib -L/usr/pkg/lib -I.  -O2  -I/pbulk/work/lang/sather/work/sather-1.2.3/System/Common -I/usr/pkg/include -I/usr/X11R7/include -I/usr/include -I/usr/pkg/include/freetype2  -c -o am_outAM_OUT1363671444.o am_outAM_OUT1363671444.c
gcc -I/usr/X11R7/include -I/usr/pkg/include/gc -L/usr/pkg/lib -Wl,-R/usr/pkg/lib -I/usr/pkg/include -I/usr/pkg/include -Wl,-R/usr/X11R7/lib -L/usr/X11R7/lib -Wl,-R/usr/pkg/lib -L/usr/pkg/lib -Wl,-R/usr/pkg/lib -L/usr/pkg/lib -I.  -O2  -I/pbulk/work/lang/sather/work/sather-1.2.3/System/Common -I/usr/pkg/include -I/usr/X11R7/include -I/usr/include -I/usr/pkg/include/freetype2  -c -o am_outAM_OUT1363671444x.o am_outAM_OUT1363671444x.c
gcc -I/usr/X11R7/include -I/usr/pkg/include/gc -L/usr/pkg/lib -Wl,-R/usr/pkg/lib -I/usr/pkg/include -I/usr/pkg/include -Wl,-R/usr/X11R7/lib -L/usr/X11R7/lib -Wl,-R/usr/pkg/lib -L/usr/pkg/lib -Wl,-R/usr/pkg/lib -L/usr/pkg/lib -I.  -O2  -I/pbulk/work/lang/sather/work/sather-1.2.3/System/Common -I/usr/pkg/include -I/usr/X11R7/include -I/usr/include -I/usr/pkg/include/freetype2  -c -o arefFSETAM_ROU1518004496.o arefFSETAM_ROU1518004496.c
gcc -I/usr/X11R7/include -I/usr/pkg/include/gc -L/usr/pkg/lib -Wl,-R/usr/pkg/lib -I/usr/pkg/include -I/usr/pkg/include -Wl,-R/usr/X11R7/lib -L/usr/X11R7/lib -Wl,-R/usr/pkg/lib -L/usr/pkg/lib -Wl,-R/usr/pkg/lib -L/usr/pkg/lib -I.  -O2  -I/pbulk/work/lang/sather/work/sather-1.2.3/System/Common -I/usr/pkg/include -I/usr/X11R7/include -I/usr/include -I/usr/pkg/include/freetype2  -c -o arefFSETIMMUTA2116029667.o arefFSETIMMUTA2116029667.c
gcc -I/usr/X11R7/include -I/usr/pkg/include/gc -L/usr/pkg/lib -Wl,-R/usr/pkg/lib -I/usr/pkg/include -I/usr/pkg/include -Wl,-R/usr/X11R7/lib -L/usr/X11R7/lib -Wl,-R/usr/pkg/lib -L/usr/pkg/lib -Wl,-R/usr/pkg/lib -L/usr/pkg/lib -I.  -O2  -I/pbulk/work/lang/sather/work/sather-1.2.3/System/Common -I/usr/pkg/include -I/usr/X11R7/include -I/usr/include -I/usr/pkg/include/freetype2  -c -o arefFSETTUPSIG268064465.o arefFSETTUPSIG268064465.c
gcc -I/usr/X11R7/include -I/usr/pkg/include/gc -L/usr/pkg/lib -Wl,-R/usr/pkg/lib -I/usr/pkg/include -I/usr/pkg/include -Wl,-R/usr/X11R7/lib -L/usr/X11R7/lib -Wl,-R/usr/pkg/lib -L/usr/pkg/lib -Wl,-R/usr/pkg/lib -L/usr/pkg/lib -I.  -O2  -I/pbulk/work/lang/sather/work/sather-1.2.3/System/Common -I/usr/pkg/include -I/usr/X11R7/include -I/usr/include -I/usr/pkg/include/freetype2  -c -o arrayARRAYAM_I1084914261.o arrayARRAYAM_I1084914261.c
gcc -I/usr/X11R7/include -I/usr/pkg/include/gc -L/usr/pkg/lib -Wl,-R/usr/pkg/lib -I/usr/pkg/include -I/usr/pkg/include -Wl,-R/usr/X11R7/lib -L/usr/X11R7/lib -Wl,-R/usr/pkg/lib -L/usr/pkg/lib -Wl,-R/usr/pkg/lib -L/usr/pkg/lib -I.  -O2  -I/pbulk/work/lang/sather/work/sather-1.2.3/System/Common -I/usr/pkg/include -I/usr/X11R7/include -I/usr/include -I/usr/pkg/include/freetype2  -c -o arrayARRAYTUPI1927875024.o arrayARRAYTUPI1927875024.c
gcc -I/usr/X11R7/include -I/usr/pkg/include/gc -L/usr/pkg/lib -Wl,-R/usr/pkg/lib -I/usr/pkg/include -I/usr/pkg/include -Wl,-R/usr/X11R7/lib -L/usr/X11R7/lib -Wl,-R/usr/pkg/lib -L/usr/pkg/lib -Wl,-R/usr/pkg/lib -L/usr/pkg/lib -I.  -O2  -I/pbulk/work/lang/sather/work/sather-1.2.3/System/Common -I/usr/pkg/include -I/usr/X11R7/include -I/usr/include -I/usr/pkg/include/freetype2  -c -o as_outAS_OUT1429002792.o as_outAS_OUT1429002792.c
gcc -I/usr/X11R7/include -I/usr/pkg/include/gc -L/usr/pkg/lib -Wl,-R/usr/pkg/lib -I/usr/pkg/include -I/usr/pkg/include -Wl,-R/usr/X11R7/lib -L/usr/X11R7/lib -Wl,-R/usr/pkg/lib -L/usr/pkg/lib -Wl,-R/usr/pkg/lib -L/usr/pkg/lib -I.  -O2  -I/pbulk/work/lang/sather/work/sather-1.2.3/System/Common -I/usr/pkg/include -I/usr/X11R7/include -I/usr/include -I/usr/pkg/include/freetype2  -c -o as_outAS_OUT1429002792x.o as_outAS_OUT1429002792x.c
gcc -I/usr/X11R7/include -I/usr/pkg/include/gc -L/usr/pkg/lib -Wl,-R/usr/pkg/lib -I/usr/pkg/include -I/usr/pkg/include -Wl,-R/usr/X11R7/lib -L/usr/X11R7/lib -Wl,-R/usr/pkg/lib -L/usr/pkg/lib -Wl,-R/usr/pkg/lib -L/usr/pkg/lib -I.  -O2  -I/pbulk/work/lang/sather/work/sather-1.2.3/System/Common -I/usr/pkg/include -I/usr/X11R7/include -I/usr/include -I/usr/pkg/include/freetype2  -c -o cgenCGEN1354269066.o cgenCGEN1354269066.c
gcc -I/usr/X11R7/include -I/usr/pkg/include/gc -L/usr/pkg/lib -Wl,-R/usr/pkg/lib -I/usr/pkg/include -I/usr/pkg/include -Wl,-R/usr/X11R7/lib -L/usr/X11R7/lib -Wl,-R/usr/pkg/lib -L/usr/pkg/lib -Wl,-R/usr/pkg/lib -L/usr/pkg/lib -I.  -O2  -I/pbulk/work/lang/sather/work/sather-1.2.3/System/Common -I/usr/pkg/include -I/usr/X11R7/include -I/usr/include -I/usr/pkg/include/freetype2  -c -o cgenCGEN1354269066x.o cgenCGEN1354269066x.c
gcc -I/usr/X11R7/include -I/usr/pkg/include/gc -L/usr/pkg/lib -Wl,-R/usr/pkg/lib -I/usr/pkg/include -I/usr/pkg/include -Wl,-R/usr/X11R7/lib -L/usr/X11R7/lib -Wl,-R/usr/pkg/lib -L/usr/pkg/lib -Wl,-R/usr/pkg/lib -L/usr/pkg/lib -I.  -O2  -I/pbulk/work/lang/sather/work/sather-1.2.3/System/Common -I/usr/pkg/include -I/usr/X11R7/include -I/usr/include -I/usr/pkg/include/freetype2  -c -o cgenCGEN1354269066xx.o cgenCGEN1354269066xx.c
gcc -I/usr/X11R7/include -I/usr/pkg/include/gc -L/usr/pkg/lib -Wl,-R/usr/pkg/lib -I/usr/pkg/include -I/usr/pkg/include -Wl,-R/usr/X11R7/lib -L/usr/X11R7/lib -Wl,-R/usr/pkg/lib -L/usr/pkg/lib -Wl,-R/usr/pkg/lib -L/usr/pkg/lib -I.  -O2  -I/pbulk/work/lang/sather/work/sather-1.2.3/System/Common -I/usr/pkg/include -I/usr/X11R7/include -I/usr/include -I/usr/pkg/include/freetype2  -c -o cgenCGEN1354269066xxx.o cgenCGEN1354269066xxx.c
gcc -I/usr/X11R7/include -I/usr/pkg/include/gc -L/usr/pkg/lib -Wl,-R/usr/pkg/lib -I/usr/pkg/include -I/usr/pkg/include -Wl,-R/usr/X11R7/lib -L/usr/X11R7/lib -Wl,-R/usr/pkg/lib -L/usr/pkg/lib -Wl,-R/usr/pkg/lib -L/usr/pkg/lib -I.  -O2  -I/pbulk/work/lang/sather/work/sather-1.2.3/System/Common -I/usr/pkg/include -I/usr/X11R7/include -I/usr/include -I/usr/pkg/include/freetype2  -c -o cgenCGEN1354269066xxxx.o cgenCGEN1354269066xxxx.c
gcc -I/usr/X11R7/include -I/usr/pkg/include/gc -L/usr/pkg/lib -Wl,-R/usr/pkg/lib -I/usr/pkg/include -I/usr/pkg/include -Wl,-R/usr/X11R7/lib -L/usr/X11R7/lib -Wl,-R/usr/pkg/lib -L/usr/pkg/lib -Wl,-R/usr/pkg/lib -L/usr/pkg/lib -I.  -O2  -I/pbulk/work/lang/sather/work/sather-1.2.3/System/Common -I/usr/pkg/include -I/usr/X11R7/include -I/usr/include -I/usr/pkg/include/freetype2  -c -o cgenCGEN1354269066xxxxx.o cgenCGEN1354269066xxxxx.c
gcc -I/usr/X11R7/include -I/usr/pkg/include/gc -L/usr/pkg/lib -Wl,-R/usr/pkg/lib -I/usr/pkg/include -I/usr/pkg/include -Wl,-R/usr/X11R7/lib -L/usr/X11R7/lib -Wl,-R/usr/pkg/lib -L/usr/pkg/lib -Wl,-R/usr/pkg/lib -L/usr/pkg/lib -I.  -O2  -I/pbulk/work/lang/sather/work/sather-1.2.3/System/Common -I/usr/pkg/include -I/usr/X11R7/include -I/usr/include -I/usr/pkg/include/freetype2  -c -o cgenCGEN1354269066xxxxxx.o cgenCGEN1354269066xxxxxx.c
gcc -I/usr/X11R7/include -I/usr/pkg/include/gc -L/usr/pkg/lib -Wl,-R/usr/pkg/lib -I/usr/pkg/include -I/usr/pkg/include -Wl,-R/usr/X11R7/lib -L/usr/X11R7/lib -Wl,-R/usr/pkg/lib -L/usr/pkg/lib -Wl,-R/usr/pkg/lib -L/usr/pkg/lib -I.  -O2  -I/pbulk/work/lang/sather/work/sather-1.2.3/System/Common -I/usr/pkg/include -I/usr/X11R7/include -I/usr/include -I/usr/pkg/include/freetype2  -c -o cgenCGEN1354269066xxxxxxx.o cgenCGEN1354269066xxxxxxx.c
gcc -I/usr/X11R7/include -I/usr/pkg/include/gc -L/usr/pkg/lib -Wl,-R/usr/pkg/lib -I/usr/pkg/include -I/usr/pkg/include -Wl,-R/usr/X11R7/lib -L/usr/X11R7/lib -Wl,-R/usr/pkg/lib -L/usr/pkg/lib -Wl,-R/usr/pkg/lib -L/usr/pkg/lib -I.  -O2  -I/pbulk/work/lang/sather/work/sather-1.2.3/System/Common -I/usr/pkg/include -I/usr/X11R7/include -I/usr/include -I/usr/pkg/include/freetype2  -c -o cgenCGEN1354269066xxxxxxxx.o cgenCGEN1354269066xxxxxxxx.c
gcc -I/usr/X11R7/include -I/usr/pkg/include/gc -L/usr/pkg/lib -Wl,-R/usr/pkg/lib -I/usr/pkg/include -I/usr/pkg/include -Wl,-R/usr/X11R7/lib -L/usr/X11R7/lib -Wl,-R/usr/pkg/lib -L/usr/pkg/lib -Wl,-R/usr/pkg/lib -L/usr/pkg/lib -I.  -O2  -I/pbulk/work/lang/sather/work/sather-1.2.3/System/Common -I/usr/pkg/include -I/usr/X11R7/include -I/usr/include -I/usr/pkg/include/freetype2  -c -o cgenCGEN1354269066xxxxxxxxx.o cgenCGEN1354269066xxxxxxxxx.c
gcc -I/usr/X11R7/include -I/usr/pkg/include/gc -L/usr/pkg/lib -Wl,-R/usr/pkg/lib -I/usr/pkg/include -I/usr/pkg/include -Wl,-R/usr/X11R7/lib -L/usr/X11R7/lib -Wl,-R/usr/pkg/lib -L/usr/pkg/lib -Wl,-R/usr/pkg/lib -L/usr/pkg/lib -I.  -O2  -I/pbulk/work/lang/sather/work/sather-1.2.3/System/Common -I/usr/pkg/include -I/usr/X11R7/include -I/usr/include -I/usr/pkg/include/freetype2  -c -o cgenCGEN1354269066xxxxxxxxxx.o cgenCGEN1354269066xxxxxxxxxx.c
gcc -I/usr/X11R7/include -I/usr/pkg/include/gc -L/usr/pkg/lib -Wl,-R/usr/pkg/lib -I/usr/pkg/include -I/usr/pkg/include -Wl,-R/usr/X11R7/lib -L/usr/X11R7/lib -Wl,-R/usr/pkg/lib -L/usr/pkg/lib -Wl,-R/usr/pkg/lib -L/usr/pkg/lib -I.  -O2  -I/pbulk/work/lang/sather/work/sather-1.2.3/System/Common -I/usr/pkg/include -I/usr/X11R7/include -I/usr/include -I/usr/pkg/include/freetype2  -c -o code_fileCODE_372141741.o code_fileCODE_372141741.c
code_fileCODE_372141741.c: In function 'CODE_F1479352172':
code_fileCODE_372141741.c:5616:2: warning: implicit declaration of function 'mkdir' [-Wimplicit-function-declaration]
 5616 |  mkdir(((L1==NULL)?NULL:L1->arr_part), 511);
      |  ^~~~~
code_fileCODE_372141741.c: In function 'CODE_F423548741':
code_fileCODE_372141741.c:7594:3: warning: 'return' with no value, in function returning non-void
 7594 |   return;
      |   ^~~~~~
code_fileCODE_372141741.c:7485:5: note: declared here
 7485 | STR CODE_F423548741(CODE_F423548741_frame frame) {
      |     ^~~~~~~~~~~~~~~
code_fileCODE_372141741.c:7698:3: warning: 'return' with no value, in function returning non-void
 7698 |   return;
      |   ^~~~~~
code_fileCODE_372141741.c:7485:5: note: declared here
 7485 | STR CODE_F423548741(CODE_F423548741_frame frame) {
      |     ^~~~~~~~~~~~~~~
gcc -I/usr/X11R7/include -I/usr/pkg/include/gc -L/usr/pkg/lib -Wl,-R/usr/pkg/lib -I/usr/pkg/include -I/usr/pkg/include -Wl,-R/usr/X11R7/lib -L/usr/X11R7/lib -Wl,-R/usr/pkg/lib -L/usr/pkg/lib -Wl,-R/usr/pkg/lib -L/usr/pkg/lib -I.  -O2  -I/pbulk/work/lang/sather/work/sather-1.2.3/System/Common -I/usr/pkg/include -I/usr/X11R7/include -I/usr/include -I/usr/pkg/include/freetype2  -c -o configCONFIG_R422014871.o configCONFIG_R422014871.c
configCONFIG_R422014871.c: In function 'CONFIG1589956977':
configCONFIG_R422014871.c:7255:4: warning: 'return' with no value, in function returning non-void
 7255 |    return;
      |    ^~~~~~
configCONFIG_R422014871.c:7227:10: note: declared here
 7227 | FLISTSTR CONFIG1589956977(CONFIG1589956977_frame frame) {
      |          ^~~~~~~~~~~~~~~~
configCONFIG_R422014871.c: In function 'CONFIG875430285':
configCONFIG_R422014871.c:7333:4: warning: 'return' with no value, in function returning non-void
 7333 |    return;
      |    ^~~~~~
configCONFIG_R422014871.c:7274:5: note: declared here
 7274 | STR CONFIG875430285(CONFIG875430285_frame frame) {
      |     ^~~~~~~~~~~~~~~
gcc -I/usr/X11R7/include -I/usr/pkg/include/gc -L/usr/pkg/lib -Wl,-R/usr/pkg/lib -I/usr/pkg/include -I/usr/pkg/include -Wl,-R/usr/X11R7/lib -L/usr/X11R7/lib -Wl,-R/usr/pkg/lib -L/usr/pkg/lib -Wl,-R/usr/pkg/lib -L/usr/pkg/lib -I.  -O2  -I/pbulk/work/lang/sather/work/sather-1.2.3/System/Common -I/usr/pkg/include -I/usr/X11R7/include -I/usr/include -I/usr/pkg/include/freetype2  -c -o constAM_STR_CO317674043.o constAM_STR_CO317674043.c
gcc -I/usr/X11R7/include -I/usr/pkg/include/gc -L/usr/pkg/lib -Wl,-R/usr/pkg/lib -I/usr/pkg/include -I/usr/pkg/include -Wl,-R/usr/X11R7/lib -L/usr/X11R7/lib -Wl,-R/usr/pkg/lib -L/usr/pkg/lib -Wl,-R/usr/pkg/lib -L/usr/pkg/lib -I.  -O2  -I/pbulk/work/lang/sather/work/sather-1.2.3/System/Common -I/usr/pkg/include -I/usr/X11R7/include -I/usr/include -I/usr/pkg/include/freetype2  -c -o cs_optionsCS_O301318552.o cs_optionsCS_O301318552.c
gcc -I/usr/X11R7/include -I/usr/pkg/include/gc -L/usr/pkg/lib -Wl,-R/usr/pkg/lib -I/usr/pkg/include -I/usr/pkg/include -Wl,-R/usr/X11R7/lib -L/usr/X11R7/lib -Wl,-R/usr/pkg/lib -L/usr/pkg/lib -Wl,-R/usr/pkg/lib -L/usr/pkg/lib -I.  -O2  -I/pbulk/work/lang/sather/work/sather-1.2.3/System/Common -I/usr/pkg/include -I/usr/X11R7/include -I/usr/include -I/usr/pkg/include/freetype2  -c -o cs_optionsCS_O301318552x.o cs_optionsCS_O301318552x.c
gcc -I/usr/X11R7/include -I/usr/pkg/include/gc -L/usr/pkg/lib -Wl,-R/usr/pkg/lib -I/usr/pkg/include -I/usr/pkg/include -Wl,-R/usr/X11R7/lib -L/usr/X11R7/lib -Wl,-R/usr/pkg/lib -L/usr/pkg/lib -Wl,-R/usr/pkg/lib -L/usr/pkg/lib -I.  -O2  -I/pbulk/work/lang/sather/work/sather-1.2.3/System/Common -I/usr/pkg/include -I/usr/X11R7/include -I/usr/include -I/usr/pkg/include/freetype2  -c -o cursorAM_CURSO1314676474.o cursorAM_CURSO1314676474.c
gcc -I/usr/X11R7/include -I/usr/pkg/include/gc -L/usr/pkg/lib -Wl,-R/usr/pkg/lib -I/usr/pkg/include -I/usr/pkg/include -Wl,-R/usr/X11R7/lib -L/usr/X11R7/lib -Wl,-R/usr/pkg/lib -L/usr/pkg/lib -Wl,-R/usr/pkg/lib -L/usr/pkg/lib -I.  -O2  -I/pbulk/work/lang/sather/work/sather-1.2.3/System/Common -I/usr/pkg/include -I/usr/X11R7/include -I/usr/include -I/usr/pkg/include/freetype2  -c -o cursorAM_CURSO1314676474x.o cursorAM_CURSO1314676474x.c
cursorAM_CURSO1314676474x.c: In function 'AM_CUR1040670508':
cursorAM_CURSO1314676474x.c:6773:4: warning: 'return' with no value, in function returning non-void
 6773 |    return;
      |    ^~~~~~
cursorAM_CURSO1314676474x.c:6753:5: note: declared here
 6753 | dAM AM_CUR1040670508(AM_CUR1040670508_frame frame) {
      |     ^~~~~~~~~~~~~~~~
gcc -I/usr/X11R7/include -I/usr/pkg/include/gc -L/usr/pkg/lib -Wl,-R/usr/pkg/lib -I/usr/pkg/include -I/usr/pkg/include -Wl,-R/usr/X11R7/lib -L/usr/X11R7/lib -Wl,-R/usr/pkg/lib -L/usr/pkg/lib -Wl,-R/usr/pkg/lib -L/usr/pkg/lib -I.  -O2  -I/pbulk/work/lang/sather/work/sather-1.2.3/System/Common -I/usr/pkg/include -I/usr/X11R7/include -I/usr/include -I/usr/pkg/include/freetype2  -c -o cursorAM_CURSO1314676474xx.o cursorAM_CURSO1314676474xx.c
gcc -I/usr/X11R7/include -I/usr/pkg/include/gc -L/usr/pkg/lib -Wl,-R/usr/pkg/lib -I/usr/pkg/include -I/usr/pkg/include -Wl,-R/usr/X11R7/lib -L/usr/X11R7/lib -Wl,-R/usr/pkg/lib -L/usr/pkg/lib -Wl,-R/usr/pkg/lib -L/usr/pkg/lib -I.  -O2  -I/pbulk/work/lang/sather/work/sather-1.2.3/System/Common -I/usr/pkg/include -I/usr/X11R7/include -I/usr/include -I/usr/pkg/include/freetype2  -c -o cursorAM_CURSO1314676474xxx.o cursorAM_CURSO1314676474xxx.c
gcc -I/usr/X11R7/include -I/usr/pkg/include/gc -L/usr/pkg/lib -Wl,-R/usr/pkg/lib -I/usr/pkg/include -I/usr/pkg/include -Wl,-R/usr/X11R7/lib -L/usr/X11R7/lib -Wl,-R/usr/pkg/lib -L/usr/pkg/lib -Wl,-R/usr/pkg/lib -L/usr/pkg/lib -I.  -O2  -I/pbulk/work/lang/sather/work/sather-1.2.3/System/Common -I/usr/pkg/include -I/usr/X11R7/include -I/usr/include -I/usr/pkg/include/freetype2  -c -o dispatch.o dispatch.c
gcc -I/usr/X11R7/include -I/usr/pkg/include/gc -L/usr/pkg/lib -Wl,-R/usr/pkg/lib -I/usr/pkg/include -I/usr/pkg/include -Wl,-R/usr/X11R7/lib -L/usr/X11R7/lib -Wl,-R/usr/pkg/lib -L/usr/pkg/lib -Wl,-R/usr/pkg/lib -L/usr/pkg/lib -I.  -O2  -I/pbulk/work/lang/sather/work/sather-1.2.3/System/Common -I/usr/pkg/include -I/usr/X11R7/include -I/usr/include -I/usr/pkg/include/freetype2  -c -o eltELT742463773.o eltELT742463773.c
gcc -I/usr/X11R7/include -I/usr/pkg/include/gc -L/usr/pkg/lib -Wl,-R/usr/pkg/lib -I/usr/pkg/include -I/usr/pkg/include -Wl,-R/usr/X11R7/lib -L/usr/X11R7/lib -Wl,-R/usr/pkg/lib -L/usr/pkg/lib -Wl,-R/usr/pkg/lib -L/usr/pkg/lib -I.  -O2  -I/pbulk/work/lang/sather/work/sather-1.2.3/System/Common -I/usr/pkg/include -I/usr/X11R7/include -I/usr/include -I/usr/pkg/include/freetype2  -c -o elt_algELT_ALG1548486913.o elt_algELT_ALG1548486913.c
gcc -I/usr/X11R7/include -I/usr/pkg/include/gc -L/usr/pkg/lib -Wl,-R/usr/pkg/lib -I/usr/pkg/include -I/usr/pkg/include -Wl,-R/usr/X11R7/lib -L/usr/X11R7/lib -Wl,-R/usr/pkg/lib -L/usr/pkg/lib -Wl,-R/usr/pkg/lib -L/usr/pkg/lib -I.  -O2  -I/pbulk/work/lang/sather/work/sather-1.2.3/System/Common -I/usr/pkg/include -I/usr/X11R7/include -I/usr/include -I/usr/pkg/include/freetype2  -c -o elt_algELT_ALG241706736.o elt_algELT_ALG241706736.c
gcc -I/usr/X11R7/include -I/usr/pkg/include/gc -L/usr/pkg/lib -Wl,-R/usr/pkg/lib -I/usr/pkg/include -I/usr/pkg/include -Wl,-R/usr/X11R7/lib -L/usr/X11R7/lib -Wl,-R/usr/pkg/lib -L/usr/pkg/lib -Wl,-R/usr/pkg/lib -L/usr/pkg/lib -I.  -O2  -I/pbulk/work/lang/sather/work/sather-1.2.3/System/Common -I/usr/pkg/include -I/usr/X11R7/include -I/usr/include -I/usr/pkg/include/freetype2  -c -o elt_algELT_ALG433952755.o elt_algELT_ALG433952755.c
gcc -I/usr/X11R7/include -I/usr/pkg/include/gc -L/usr/pkg/lib -Wl,-R/usr/pkg/lib -I/usr/pkg/include -I/usr/pkg/include -Wl,-R/usr/X11R7/lib -L/usr/X11R7/lib -Wl,-R/usr/pkg/lib -L/usr/pkg/lib -Wl,-R/usr/pkg/lib -L/usr/pkg/lib -I.  -O2  -I/pbulk/work/lang/sather/work/sather-1.2.3/System/Common -I/usr/pkg/include -I/usr/X11R7/include -I/usr/include -I/usr/pkg/include/freetype2  -c -o elt_algELT_ALG656599769.o elt_algELT_ALG656599769.c
gcc -I/usr/X11R7/include -I/usr/pkg/include/gc -L/usr/pkg/lib -Wl,-R/usr/pkg/lib -I/usr/pkg/include -I/usr/pkg/include -Wl,-R/usr/X11R7/lib -L/usr/X11R7/lib -Wl,-R/usr/pkg/lib -L/usr/pkg/lib -Wl,-R/usr/pkg/lib -L/usr/pkg/lib -I.  -O2  -I/pbulk/work/lang/sather/work/sather-1.2.3/System/Common -I/usr/pkg/include -I/usr/X11R7/include -I/usr/include -I/usr/pkg/include/freetype2  -c -o elt_algELT_ALG987448979.o elt_algELT_ALG987448979.c
gcc -I/usr/X11R7/include -I/usr/pkg/include/gc -L/usr/pkg/lib -Wl,-R/usr/pkg/lib -I/usr/pkg/include -I/usr/pkg/include -Wl,-R/usr/X11R7/lib -L/usr/X11R7/lib -Wl,-R/usr/pkg/lib -L/usr/pkg/lib -Wl,-R/usr/pkg/lib -L/usr/pkg/lib -I.  -O2  -I/pbulk/work/lang/sather/work/sather-1.2.3/System/Common -I/usr/pkg/include -I/usr/X11R7/include -I/usr/include -I/usr/pkg/include/freetype2  -c -o flistFLISTAM_C1171004157.o flistFLISTAM_C1171004157.c
gcc -I/usr/X11R7/include -I/usr/pkg/include/gc -L/usr/pkg/lib -Wl,-R/usr/pkg/lib -I/usr/pkg/include -I/usr/pkg/include -Wl,-R/usr/X11R7/lib -L/usr/X11R7/lib -Wl,-R/usr/pkg/lib -L/usr/pkg/lib -Wl,-R/usr/pkg/lib -L/usr/pkg/lib -I.  -O2  -I/pbulk/work/lang/sather/work/sather-1.2.3/System/Common -I/usr/pkg/include -I/usr/X11R7/include -I/usr/include -I/usr/pkg/include/freetype2  -c -o flistFLISTTUPA253333040.o flistFLISTTUPA253333040.c
In file included from /pbulk/work/lang/sather/work/sather-1.2.3/System/Platforms/netbsd/../../Common/c_header.h:239,
                 from /pbulk/work/lang/sather/work/sather-1.2.3/System/Platforms/netbsd/header.h:8,
                 from sather.h:4,
                 from flistFLISTTUPA253333040.c:1:
flistFLISTTUPA253333040.c: In function 'r_signaling_nan':
flistFLISTTUPA253333040.c:1832:9: warning: implicit declaration of function 'signaling_nan'; did you mean 'r_signaling_nan'? [-Wimplicit-function-declaration]
 1832 | _FM_F_I(signaling_nan)
      |         ^~~~~~~~~~~~~
/pbulk/work/lang/sather/work/sather-1.2.3/System/Platforms/netbsd/../../Common/floatmath.h:110:60: note: in definition of macro '_FM_F_I'
  110 | #define _FM_F_I(name)  static FLT r_##name(INT i) { return name(i); }
      |                                                            ^~~~
gcc -I/usr/X11R7/include -I/usr/pkg/include/gc -L/usr/pkg/lib -Wl,-R/usr/pkg/lib -I/usr/pkg/include -I/usr/pkg/include -Wl,-R/usr/X11R7/lib -L/usr/X11R7/lib -Wl,-R/usr/pkg/lib -L/usr/pkg/lib -Wl,-R/usr/pkg/lib -L/usr/pkg/lib -I.  -O2  -I/pbulk/work/lang/sather/work/sather-1.2.3/System/Common -I/usr/pkg/include -I/usr/X11R7/include -I/usr/include -I/usr/pkg/include/freetype2  -c -o fmapFMAPAM_ROU1000508936.o fmapFMAPAM_ROU1000508936.c
gcc -I/usr/X11R7/include -I/usr/pkg/include/gc -L/usr/pkg/lib -Wl,-R/usr/pkg/lib -I/usr/pkg/include -I/usr/pkg/include -Wl,-R/usr/X11R7/lib -L/usr/X11R7/lib -Wl,-R/usr/pkg/lib -L/usr/pkg/lib -Wl,-R/usr/pkg/lib -L/usr/pkg/lib -I.  -O2  -I/pbulk/work/lang/sather/work/sather-1.2.3/System/Common -I/usr/pkg/include -I/usr/X11R7/include -I/usr/include -I/usr/pkg/include/freetype2  -c -o fmapFMAPSTRFSE258056667.o fmapFMAPSTRFSE258056667.c
gcc -I/usr/X11R7/include -I/usr/pkg/include/gc -L/usr/pkg/lib -Wl,-R/usr/pkg/lib -I/usr/pkg/include -I/usr/pkg/include -Wl,-R/usr/X11R7/lib -L/usr/X11R7/lib -Wl,-R/usr/pkg/lib -L/usr/pkg/lib -Wl,-R/usr/pkg/lib -L/usr/pkg/lib -I.  -O2  -I/pbulk/work/lang/sather/work/sather-1.2.3/System/Common -I/usr/pkg/include -I/usr/X11R7/include -I/usr/include -I/usr/pkg/include/freetype2  -c -o fmapFMAPdTPCOD1051074108.o fmapFMAPdTPCOD1051074108.c
fmapFMAPdTPCOD1051074108.c: In function 'ELT_TB431570775':
fmapFMAPdTPCOD1051074108.c:6402:3: warning: 'return' with no value, in function returning non-void
 6402 |   return;
      |   ^~~~~~
fmapFMAPdTPCOD1051074108.c:6372:5: note: declared here
 6372 | ELT ELT_TB431570775(ELT_TB431570775_frame frame) {
      |     ^~~~~~~~~~~~~~~
fmapFMAPdTPCOD1051074108.c: In function 'SIG_TB788365833':
fmapFMAPdTPCOD1051074108.c:6814:3: warning: 'return' with no value, in function returning non-void
 6814 |   return;
      |   ^~~~~~
fmapFMAPdTPCOD1051074108.c:6784:5: note: declared here
 6784 | SIG SIG_TB788365833(SIG_TB788365833_frame frame) {
      |     ^~~~~~~~~~~~~~~
gcc -I/usr/X11R7/include -I/usr/pkg/include/gc -L/usr/pkg/lib -Wl,-R/usr/pkg/lib -I/usr/pkg/include -I/usr/pkg/include -Wl,-R/usr/X11R7/lib -L/usr/X11R7/lib -Wl,-R/usr/pkg/lib -L/usr/pkg/lib -Wl,-R/usr/pkg/lib -L/usr/pkg/lib -I.  -O2  -I/pbulk/work/lang/sather/work/sather-1.2.3/System/Common -I/usr/pkg/include -I/usr/X11R7/include -I/usr/include -I/usr/pkg/include/freetype2  -c -o generate_amGEN60284023.o generate_amGEN60284023.c
gcc -I/usr/X11R7/include -I/usr/pkg/include/gc -L/usr/pkg/lib -Wl,-R/usr/pkg/lib -I/usr/pkg/include -I/usr/pkg/include -Wl,-R/usr/X11R7/lib -L/usr/X11R7/lib -Wl,-R/usr/pkg/lib -L/usr/pkg/lib -Wl,-R/usr/pkg/lib -L/usr/pkg/lib -I.  -O2  -I/pbulk/work/lang/sather/work/sather-1.2.3/System/Common -I/usr/pkg/include -I/usr/X11R7/include -I/usr/include -I/usr/pkg/include/freetype2  -c -o get_optionsCOD183550016.o get_optionsCOD183550016.c
gcc -I/usr/X11R7/include -I/usr/pkg/include/gc -L/usr/pkg/lib -Wl,-R/usr/pkg/lib -I/usr/pkg/include -I/usr/pkg/include -Wl,-R/usr/X11R7/lib -L/usr/X11R7/lib -Wl,-R/usr/pkg/lib -L/usr/pkg/lib -Wl,-R/usr/pkg/lib -L/usr/pkg/lib -I.  -O2  -I/pbulk/work/lang/sather/work/sather-1.2.3/System/Common -I/usr/pkg/include -I/usr/X11R7/include -I/usr/include -I/usr/pkg/include/freetype2  -c -o globals.o globals.c
gcc -I/usr/X11R7/include -I/usr/pkg/include/gc -L/usr/pkg/lib -Wl,-R/usr/pkg/lib -I/usr/pkg/include -I/usr/pkg/include -Wl,-R/usr/X11R7/lib -L/usr/X11R7/lib -Wl,-R/usr/pkg/lib -L/usr/pkg/lib -Wl,-R/usr/pkg/lib -L/usr/pkg/lib -I.  -O2  -I/pbulk/work/lang/sather/work/sather-1.2.3/System/Common -I/usr/pkg/include -I/usr/X11R7/include -I/usr/include -I/usr/pkg/include/freetype2  -c -o get_optionsCOD183550016x.o get_optionsCOD183550016x.c
gcc -I/usr/X11R7/include -I/usr/pkg/include/gc -L/usr/pkg/lib -Wl,-R/usr/pkg/lib -I/usr/pkg/include -I/usr/pkg/include -Wl,-R/usr/X11R7/lib -L/usr/X11R7/lib -Wl,-R/usr/pkg/lib -L/usr/pkg/lib -Wl,-R/usr/pkg/lib -L/usr/pkg/lib -I.  -O2  -I/pbulk/work/lang/sather/work/sather-1.2.3/System/Common -I/usr/pkg/include -I/usr/X11R7/include -I/usr/include -I/usr/pkg/include/freetype2  -c -o implIMPL_CREAT99472218.o implIMPL_CREAT99472218.c
gcc -I/usr/X11R7/include -I/usr/pkg/include/gc -L/usr/pkg/lib -Wl,-R/usr/pkg/lib -I/usr/pkg/include -I/usr/pkg/include -Wl,-R/usr/X11R7/lib -L/usr/X11R7/lib -Wl,-R/usr/pkg/lib -L/usr/pkg/lib -Wl,-R/usr/pkg/lib -L/usr/pkg/lib -I.  -O2  -I/pbulk/work/lang/sather/work/sather-1.2.3/System/Common -I/usr/pkg/include -I/usr/X11R7/include -I/usr/include -I/usr/pkg/include/freetype2  -c -o inlineINLINE_I1557365391.o inlineINLINE_I1557365391.c
gcc -I/usr/X11R7/include -I/usr/pkg/include/gc -L/usr/pkg/lib -Wl,-R/usr/pkg/lib -I/usr/pkg/include -I/usr/pkg/include -Wl,-R/usr/X11R7/lib -L/usr/X11R7/lib -Wl,-R/usr/pkg/lib -L/usr/pkg/lib -Wl,-R/usr/pkg/lib -L/usr/pkg/lib -I.  -O2  -I/pbulk/work/lang/sather/work/sather-1.2.3/System/Common -I/usr/pkg/include -I/usr/X11R7/include -I/usr/include -I/usr/pkg/include/freetype2  -c -o intiINTI1462257232.o intiINTI1462257232.c
gcc -I/usr/X11R7/include -I/usr/pkg/include/gc -L/usr/pkg/lib -Wl,-R/usr/pkg/lib -I/usr/pkg/include -I/usr/pkg/include -Wl,-R/usr/X11R7/lib -L/usr/X11R7/lib -Wl,-R/usr/pkg/lib -L/usr/pkg/lib -Wl,-R/usr/pkg/lib -L/usr/pkg/lib -I.  -O2  -I/pbulk/work/lang/sather/work/sather-1.2.3/System/Common -I/usr/pkg/include -I/usr/X11R7/include -I/usr/include -I/usr/pkg/include/freetype2  -c -o layoutCLASS_LA1330944056.o layoutCLASS_LA1330944056.c
gcc -I/usr/X11R7/include -I/usr/pkg/include/gc -L/usr/pkg/lib -Wl,-R/usr/pkg/lib -I/usr/pkg/include -I/usr/pkg/include -Wl,-R/usr/X11R7/lib -L/usr/X11R7/lib -Wl,-R/usr/pkg/lib -L/usr/pkg/lib -Wl,-R/usr/pkg/lib -L/usr/pkg/lib -I.  -O2  -I/pbulk/work/lang/sather/work/sather-1.2.3/System/Common -I/usr/pkg/include -I/usr/X11R7/include -I/usr/include -I/usr/pkg/include/freetype2  -c -o mangleMANGLE1705139666.o mangleMANGLE1705139666.c
gcc -I/usr/X11R7/include -I/usr/pkg/include/gc -L/usr/pkg/lib -Wl,-R/usr/pkg/lib -I/usr/pkg/include -I/usr/pkg/include -Wl,-R/usr/X11R7/lib -L/usr/X11R7/lib -Wl,-R/usr/pkg/lib -L/usr/pkg/lib -Wl,-R/usr/pkg/lib -L/usr/pkg/lib -I.  -O2  -I/pbulk/work/lang/sather/work/sather-1.2.3/System/Common -I/usr/pkg/include -I/usr/X11R7/include -I/usr/include -I/usr/pkg/include/freetype2  -c -o mangleNAMESPAC760510184.o mangleNAMESPAC760510184.c
gcc -I/usr/X11R7/include -I/usr/pkg/include/gc -L/usr/pkg/lib -Wl,-R/usr/pkg/lib -I/usr/pkg/include -I/usr/pkg/include -Wl,-R/usr/X11R7/lib -L/usr/X11R7/lib -Wl,-R/usr/pkg/lib -L/usr/pkg/lib -Wl,-R/usr/pkg/lib -L/usr/pkg/lib -I.  -O2  -I/pbulk/work/lang/sather/work/sather-1.2.3/System/Common -I/usr/pkg/include -I/usr/X11R7/include -I/usr/include -I/usr/pkg/include/freetype2  -c -o o_localOPT_LOC907909712.o o_localOPT_LOC907909712.c
gcc -I/usr/X11R7/include -I/usr/pkg/include/gc -L/usr/pkg/lib -Wl,-R/usr/pkg/lib -I/usr/pkg/include -I/usr/pkg/include -Wl,-R/usr/X11R7/lib -L/usr/X11R7/lib -Wl,-R/usr/pkg/lib -L/usr/pkg/lib -Wl,-R/usr/pkg/lib -L/usr/pkg/lib -I.  -O2  -I/pbulk/work/lang/sather/work/sather-1.2.3/System/Common -I/usr/pkg/include -I/usr/X11R7/include -I/usr/include -I/usr/pkg/include/freetype2  -c -o o_localOPT_LOC907909712x.o o_localOPT_LOC907909712x.c
gcc -I/usr/X11R7/include -I/usr/pkg/include/gc -L/usr/pkg/lib -Wl,-R/usr/pkg/lib -I/usr/pkg/include -I/usr/pkg/include -Wl,-R/usr/X11R7/lib -L/usr/X11R7/lib -Wl,-R/usr/pkg/lib -L/usr/pkg/lib -Wl,-R/usr/pkg/lib -L/usr/pkg/lib -I.  -O2  -I/pbulk/work/lang/sather/work/sather-1.2.3/System/Common -I/usr/pkg/include -I/usr/X11R7/include -I/usr/include -I/usr/pkg/include/freetype2  -c -o optimizeOPT_CO1177876774.o optimizeOPT_CO1177876774.c
gcc -I/usr/X11R7/include -I/usr/pkg/include/gc -L/usr/pkg/lib -Wl,-R/usr/pkg/lib -I/usr/pkg/include -I/usr/pkg/include -Wl,-R/usr/X11R7/lib -L/usr/X11R7/lib -Wl,-R/usr/pkg/lib -L/usr/pkg/lib -Wl,-R/usr/pkg/lib -L/usr/pkg/lib -I.  -O2  -I/pbulk/work/lang/sather/work/sather-1.2.3/System/Common -I/usr/pkg/include -I/usr/X11R7/include -I/usr/include -I/usr/pkg/include/freetype2  -c -o optimizeOPT_IT1193060919.o optimizeOPT_IT1193060919.c
gcc -I/usr/X11R7/include -I/usr/pkg/include/gc -L/usr/pkg/lib -Wl,-R/usr/pkg/lib -I/usr/pkg/include -I/usr/pkg/include -Wl,-R/usr/X11R7/lib -L/usr/X11R7/lib -Wl,-R/usr/pkg/lib -L/usr/pkg/lib -Wl,-R/usr/pkg/lib -L/usr/pkg/lib -I.  -O2  -I/pbulk/work/lang/sather/work/sather-1.2.3/System/Common -I/usr/pkg/include -I/usr/X11R7/include -I/usr/include -I/usr/pkg/include/freetype2  -c -o parsePARSER311504339.o parsePARSER311504339.c
gcc -I/usr/X11R7/include -I/usr/pkg/include/gc -L/usr/pkg/lib -Wl,-R/usr/pkg/lib -I/usr/pkg/include -I/usr/pkg/include -Wl,-R/usr/X11R7/lib -L/usr/X11R7/lib -Wl,-R/usr/pkg/lib -L/usr/pkg/lib -Wl,-R/usr/pkg/lib -L/usr/pkg/lib -I.  -O2  -I/pbulk/work/lang/sather/work/sather-1.2.3/System/Common -I/usr/pkg/include -I/usr/X11R7/include -I/usr/include -I/usr/pkg/include/freetype2  -c -o parsePARSER311504339x.o parsePARSER311504339x.c
gcc -I/usr/X11R7/include -I/usr/pkg/include/gc -L/usr/pkg/lib -Wl,-R/usr/pkg/lib -I/usr/pkg/include -I/usr/pkg/include -Wl,-R/usr/X11R7/lib -L/usr/X11R7/lib -Wl,-R/usr/pkg/lib -L/usr/pkg/lib -Wl,-R/usr/pkg/lib -L/usr/pkg/lib -I.  -O2  -I/pbulk/work/lang/sather/work/sather-1.2.3/System/Common -I/usr/pkg/include -I/usr/X11R7/include -I/usr/include -I/usr/pkg/include/freetype2  -c -o parsePARSER311504339xx.o parsePARSER311504339xx.c
gcc -I/usr/X11R7/include -I/usr/pkg/include/gc -L/usr/pkg/lib -Wl,-R/usr/pkg/lib -I/usr/pkg/include -I/usr/pkg/include -Wl,-R/usr/X11R7/lib -L/usr/X11R7/lib -Wl,-R/usr/pkg/lib -L/usr/pkg/lib -Wl,-R/usr/pkg/lib -L/usr/pkg/lib -I.  -O2  -I/pbulk/work/lang/sather/work/sather-1.2.3/System/Common -I/usr/pkg/include -I/usr/X11R7/include -I/usr/include -I/usr/pkg/include/freetype2  -c -o parsePARSER311504339xxx.o parsePARSER311504339xxx.c
gcc -I/usr/X11R7/include -I/usr/pkg/include/gc -L/usr/pkg/lib -Wl,-R/usr/pkg/lib -I/usr/pkg/include -I/usr/pkg/include -Wl,-R/usr/X11R7/lib -L/usr/X11R7/lib -Wl,-R/usr/pkg/lib -L/usr/pkg/lib -Wl,-R/usr/pkg/lib -L/usr/pkg/lib -I.  -O2  -I/pbulk/work/lang/sather/work/sather-1.2.3/System/Common -I/usr/pkg/include -I/usr/X11R7/include -I/usr/include -I/usr/pkg/include/freetype2  -c -o parsePARSER311504339xxxx.o parsePARSER311504339xxxx.c
gcc -I/usr/X11R7/include -I/usr/pkg/include/gc -L/usr/pkg/lib -Wl,-R/usr/pkg/lib -I/usr/pkg/include -I/usr/pkg/include -Wl,-R/usr/X11R7/lib -L/usr/X11R7/lib -Wl,-R/usr/pkg/lib -L/usr/pkg/lib -Wl,-R/usr/pkg/lib -L/usr/pkg/lib -I.  -O2  -I/pbulk/work/lang/sather/work/sather-1.2.3/System/Common -I/usr/pkg/include -I/usr/X11R7/include -I/usr/include -I/usr/pkg/include/freetype2  -c -o progPROG_AS_TB824135997.o progPROG_AS_TB824135997.c
gcc -I/usr/X11R7/include -I/usr/pkg/include/gc -L/usr/pkg/lib -Wl,-R/usr/pkg/lib -I/usr/pkg/include -I/usr/pkg/include -Wl,-R/usr/X11R7/lib -L/usr/X11R7/lib -Wl,-R/usr/pkg/lib -L/usr/pkg/lib -Wl,-R/usr/pkg/lib -L/usr/pkg/lib -I.  -O2  -I/pbulk/work/lang/sather/work/sather-1.2.3/System/Common -I/usr/pkg/include -I/usr/X11R7/include -I/usr/include -I/usr/pkg/include/freetype2  -c -o scanSCANNER1990933774.o scanSCANNER1990933774.c
gcc -I/usr/X11R7/include -I/usr/pkg/include/gc -L/usr/pkg/lib -Wl,-R/usr/pkg/lib -I/usr/pkg/include -I/usr/pkg/include -Wl,-R/usr/X11R7/lib -L/usr/X11R7/lib -Wl,-R/usr/pkg/lib -L/usr/pkg/lib -Wl,-R/usr/pkg/lib -L/usr/pkg/lib -I.  -O2  -I/pbulk/work/lang/sather/work/sather-1.2.3/System/Common -I/usr/pkg/include -I/usr/X11R7/include -I/usr/include -I/usr/pkg/include/freetype2  -c -o side_effectSE_411721069.o side_effectSE_411721069.c
gcc -I/usr/X11R7/include -I/usr/pkg/include/gc -L/usr/pkg/lib -Wl,-R/usr/pkg/lib -I/usr/pkg/include -I/usr/pkg/include -Wl,-R/usr/X11R7/lib -L/usr/X11R7/lib -Wl,-R/usr/pkg/lib -L/usr/pkg/lib -Wl,-R/usr/pkg/lib -L/usr/pkg/lib -I.  -O2  -I/pbulk/work/lang/sather/work/sather-1.2.3/System/Common -I/usr/pkg/include -I/usr/X11R7/include -I/usr/include -I/usr/pkg/include/freetype2  -c -o strings.o strings.c
gcc -I/usr/X11R7/include -I/usr/pkg/include/gc -L/usr/pkg/lib -Wl,-R/usr/pkg/lib -I/usr/pkg/include -I/usr/pkg/include -Wl,-R/usr/X11R7/lib -L/usr/X11R7/lib -Wl,-R/usr/pkg/lib -L/usr/pkg/lib -Wl,-R/usr/pkg/lib -L/usr/pkg/lib -I.  -O2  -I/pbulk/work/lang/sather/work/sather-1.2.3/System/Common -I/usr/pkg/include -I/usr/X11R7/include -I/usr/include -I/usr/pkg/include/freetype2  -c -o stringsx.o stringsx.c
gcc -I/usr/X11R7/include -I/usr/pkg/include/gc -L/usr/pkg/lib -Wl,-R/usr/pkg/lib -I/usr/pkg/include -I/usr/pkg/include -Wl,-R/usr/X11R7/lib -L/usr/X11R7/lib -Wl,-R/usr/pkg/lib -L/usr/pkg/lib -Wl,-R/usr/pkg/lib -L/usr/pkg/lib -I.  -O2  -I/pbulk/work/lang/sather/work/sather-1.2.3/System/Common -I/usr/pkg/include -I/usr/X11R7/include -I/usr/include -I/usr/pkg/include/freetype2  -c -o stringsxx.o stringsxx.c
gcc -I/usr/X11R7/include -I/usr/pkg/include/gc -L/usr/pkg/lib -Wl,-R/usr/pkg/lib -I/usr/pkg/include -I/usr/pkg/include -Wl,-R/usr/X11R7/lib -L/usr/X11R7/lib -Wl,-R/usr/pkg/lib -L/usr/pkg/lib -Wl,-R/usr/pkg/lib -L/usr/pkg/lib -I.  -O2  -I/pbulk/work/lang/sather/work/sather-1.2.3/System/Common -I/usr/pkg/include -I/usr/X11R7/include -I/usr/include -I/usr/pkg/include/freetype2  -c -o system.o system.c
gcc -I/usr/X11R7/include -I/usr/pkg/include/gc -L/usr/pkg/lib -Wl,-R/usr/pkg/lib -I/usr/pkg/include -I/usr/pkg/include -Wl,-R/usr/X11R7/lib -L/usr/X11R7/lib -Wl,-R/usr/pkg/lib -L/usr/pkg/lib -Wl,-R/usr/pkg/lib -L/usr/pkg/lib -I.  -O2  -I/pbulk/work/lang/sather/work/sather-1.2.3/System/Common -I/usr/pkg/include -I/usr/X11R7/include -I/usr/include -I/usr/pkg/include/freetype2  -c -o stmtAM_FORK_ST1674905658.o stmtAM_FORK_ST1674905658.c
stmtAM_FORK_ST1674905658.c: In function 'STR_sp663650766':
stmtAM_FORK_ST1674905658.c:6698:3: warning: 'return' with no value, in function returning non-void
 6698 |   return;
      |   ^~~~~~
stmtAM_FORK_ST1674905658.c:6673:5: note: declared here
 6673 | STR STR_sp663650766(STR_sp663650766_frame frame) {
      |     ^~~~~~~~~~~~~~~
stmtAM_FORK_ST1674905658.c: In function 'SYSTEM675309847':
stmtAM_FORK_ST1674905658.c:6754:4: warning: 'return' with no value, in function returning non-void
 6754 |    return;
      |    ^~~~~~
stmtAM_FORK_ST1674905658.c:6743:5: note: declared here
 6743 | STR SYSTEM675309847(SYSTEM675309847_frame frame) {
      |     ^~~~~~~~~~~~~~~
stmtAM_FORK_ST1674905658.c: In function 'AS_STM1504735434':
stmtAM_FORK_ST1674905658.c:6855:3: warning: 'return' with no value, in function returning non-void
 6855 |   return;
      |   ^~~~~~
stmtAM_FORK_ST1674905658.c:6771:10: note: declared here
 6771 | dAS_STMT AS_STM1504735434(AS_STM1504735434_frame frame) {
      |          ^~~~~~~~~~~~~~~~
gcc -I/usr/X11R7/include -I/usr/pkg/include/gc -L/usr/pkg/lib -Wl,-R/usr/pkg/lib -I/usr/pkg/include -I/usr/pkg/include -Wl,-R/usr/X11R7/lib -L/usr/X11R7/lib -Wl,-R/usr/pkg/lib -L/usr/pkg/lib -Wl,-R/usr/pkg/lib -L/usr/pkg/lib -I.  -O2  -I/pbulk/work/lang/sather/work/sather-1.2.3/System/Common -I/usr/pkg/include -I/usr/X11R7/include -I/usr/include -I/usr/pkg/include/freetype2  -c -o tpTP_BUILTIN1142074570.o tpTP_BUILTIN1142074570.c
gcc -I/usr/X11R7/include -I/usr/pkg/include/gc -L/usr/pkg/lib -Wl,-R/usr/pkg/lib -I/usr/pkg/include -I/usr/pkg/include -Wl,-R/usr/X11R7/lib -L/usr/X11R7/lib -Wl,-R/usr/pkg/lib -L/usr/pkg/lib -Wl,-R/usr/pkg/lib -L/usr/pkg/lib -I.  -O2  -I/pbulk/work/lang/sather/work/sather-1.2.3/System/Common -I/usr/pkg/include -I/usr/X11R7/include -I/usr/include -I/usr/pkg/include/freetype2  -c -o tpTP_ITER145455607.o tpTP_ITER145455607.c
gcc -I/usr/X11R7/include -I/usr/pkg/include/gc -L/usr/pkg/lib -Wl,-R/usr/pkg/lib -I/usr/pkg/include -I/usr/pkg/include -Wl,-R/usr/X11R7/lib -L/usr/X11R7/lib -Wl,-R/usr/pkg/lib -L/usr/pkg/lib -Wl,-R/usr/pkg/lib -L/usr/pkg/lib -I.  -O2  -I/pbulk/work/lang/sather/work/sather-1.2.3/System/Common -I/usr/pkg/include -I/usr/X11R7/include -I/usr/include -I/usr/pkg/include/freetype2  -c -o transTRANS2123847391.o transTRANS2123847391.c
gcc -I/usr/X11R7/include -I/usr/pkg/include/gc -L/usr/pkg/lib -Wl,-R/usr/pkg/lib -I/usr/pkg/include -I/usr/pkg/include -Wl,-R/usr/X11R7/lib -L/usr/X11R7/lib -Wl,-R/usr/pkg/lib -L/usr/pkg/lib -Wl,-R/usr/pkg/lib -L/usr/pkg/lib -I.  -O2  -I/pbulk/work/lang/sather/work/sather-1.2.3/System/Common -I/usr/pkg/include -I/usr/X11R7/include -I/usr/include -I/usr/pkg/include/freetype2  -c -o transTRANS2123847391x.o transTRANS2123847391x.c
gcc -I/usr/X11R7/include -I/usr/pkg/include/gc -L/usr/pkg/lib -Wl,-R/usr/pkg/lib -I/usr/pkg/include -I/usr/pkg/include -Wl,-R/usr/X11R7/lib -L/usr/X11R7/lib -Wl,-R/usr/pkg/lib -L/usr/pkg/lib -Wl,-R/usr/pkg/lib -L/usr/pkg/lib -I.  -O2  -I/pbulk/work/lang/sather/work/sather-1.2.3/System/Common -I/usr/pkg/include -I/usr/X11R7/include -I/usr/include -I/usr/pkg/include/freetype2  -c -o transTRANS2123847391xx.o transTRANS2123847391xx.c
gcc -I/usr/X11R7/include -I/usr/pkg/include/gc -L/usr/pkg/lib -Wl,-R/usr/pkg/lib -I/usr/pkg/include -I/usr/pkg/include -Wl,-R/usr/X11R7/lib -L/usr/X11R7/lib -Wl,-R/usr/pkg/lib -L/usr/pkg/lib -Wl,-R/usr/pkg/lib -L/usr/pkg/lib -I.  -O2  -I/pbulk/work/lang/sather/work/sather-1.2.3/System/Common -I/usr/pkg/include -I/usr/X11R7/include -I/usr/include -I/usr/pkg/include/freetype2  -c -o transTRANS2123847391xxx.o transTRANS2123847391xxx.c
transTRANS2123847391xxx.c: In function 'TRANS_1349638895':
transTRANS2123847391xxx.c:7422:3: warning: 'return' with no value, in function returning non-void
 7422 |   return;
      |   ^~~~~~
transTRANS2123847391xxx.c:7396:15: note: declared here
 7396 | AM_LOCAL_EXPR TRANS_1349638895(TRANS_1349638895_frame frame) {
      |               ^~~~~~~~~~~~~~~~
gcc -I/usr/X11R7/include -I/usr/pkg/include/gc -L/usr/pkg/lib -Wl,-R/usr/pkg/lib -I/usr/pkg/include -I/usr/pkg/include -Wl,-R/usr/X11R7/lib -L/usr/X11R7/lib -Wl,-R/usr/pkg/lib -L/usr/pkg/lib -Wl,-R/usr/pkg/lib -L/usr/pkg/lib -I.  -O2  -I/pbulk/work/lang/sather/work/sather-1.2.3/System/Common -I/usr/pkg/include -I/usr/X11R7/include -I/usr/include -I/usr/pkg/include/freetype2  -c -o transTRANS2123847391xxxx.o transTRANS2123847391xxxx.c
gcc -I/usr/X11R7/include -I/usr/pkg/include/gc -L/usr/pkg/lib -Wl,-R/usr/pkg/lib -I/usr/pkg/include -I/usr/pkg/include -Wl,-R/usr/X11R7/lib -L/usr/X11R7/lib -Wl,-R/usr/pkg/lib -L/usr/pkg/lib -Wl,-R/usr/pkg/lib -L/usr/pkg/lib -I.  -O2  -I/pbulk/work/lang/sather/work/sather-1.2.3/System/Common -I/usr/pkg/include -I/usr/X11R7/include -I/usr/include -I/usr/pkg/include/freetype2  -c -o tupTUPAM_CURSO1313579705.o tupTUPAM_CURSO1313579705.c
gcc -I/usr/X11R7/include -I/usr/pkg/include/gc -L/usr/pkg/lib -Wl,-R/usr/pkg/lib -I/usr/pkg/include -I/usr/pkg/include -Wl,-R/usr/X11R7/lib -L/usr/X11R7/lib -Wl,-R/usr/pkg/lib -L/usr/pkg/lib -Wl,-R/usr/pkg/lib -L/usr/pkg/lib -I.  -O2  -I/pbulk/work/lang/sather/work/sather-1.2.3/System/Common -I/usr/pkg/include -I/usr/X11R7/include -I/usr/include -I/usr/pkg/include/freetype2  -c -o unbox.o unbox.c
gcc -I/usr/X11R7/include -I/usr/pkg/include/gc -L/usr/pkg/lib -Wl,-R/usr/pkg/lib -I/usr/pkg/include -I/usr/pkg/include -Wl,-R/usr/X11R7/lib -L/usr/X11R7/lib -Wl,-R/usr/pkg/lib -L/usr/pkg/lib -Wl,-R/usr/pkg/lib -L/usr/pkg/lib -I.  -O2  -I/pbulk/work/lang/sather/work/sather-1.2.3/System/Common -I/usr/pkg/include -I/usr/X11R7/include -I/usr/include -I/usr/pkg/include/freetype2  -c -o unixUNIX1766692.o unixUNIX1766692.c
gcc -I/usr/X11R7/include -I/usr/pkg/include/gc -L/usr/pkg/lib -Wl,-R/usr/pkg/lib -I/usr/pkg/include -I/usr/pkg/include -Wl,-R/usr/X11R7/lib -L/usr/X11R7/lib -Wl,-R/usr/pkg/lib -L/usr/pkg/lib -Wl,-R/usr/pkg/lib -L/usr/pkg/lib -I.  -O2  -I/pbulk/work/lang/sather/work/sather-1.2.3/System/Common -c /pbulk/work/lang/sather/work/sather-1.2.3/System/Common/runtime.c
gcc -I/usr/X11R7/include -I/usr/pkg/include/gc -L/usr/pkg/lib -Wl,-R/usr/pkg/lib -I/usr/pkg/include -I/usr/pkg/include -Wl,-R/usr/X11R7/lib -L/usr/X11R7/lib -Wl,-R/usr/pkg/lib -L/usr/pkg/lib -Wl,-R/usr/pkg/lib -L/usr/pkg/lib -I.  -O2  -I/pbulk/work/lang/sather/work/sather-1.2.3/System/Common -o ../sacomp a_stackA_STACK2014955575.o am_outAM_OUT1363671444.o am_outAM_OUT1363671444x.o arefFSETAM_ROU1518004496.o arefFSETIMMUTA2116029667.o arefFSETTUPSIG268064465.o arrayARRAYAM_I1084914261.o arrayARRAYTUPI1927875024.o as_outAS_OUT1429002792.o as_outAS_OUT1429002792x.o cgenCGEN1354269066.o cgenCGEN1354269066x.o cgenCGEN1354269066xx.o cgenCGEN1354269066xxx.o cgenCGEN1354269066xxxx.o cgenCGEN1354269066xxxxx.o cgenCGEN1354269066xxxxxx.o cgenCGEN1354269066xxxxxxx.o cgenCGEN1354269066xxxxxxxx.o cgenCGEN1354269066xxxxxxxxx.o cgenCGEN1354269066xxxxxxxxxx.o code_fileCODE_372141741.o configCONFIG_R422014871.o constAM_STR_CO317674043.o cs_optionsCS_O301318552.o cs_optionsCS_O301318552x.o cursorAM_CURSO1314676474.o cursorAM_CURSO1314676474x.o cursorAM_CURSO1314676474xx.o cursorAM_CURSO1314676474xxx.o dispatch.o eltELT742463773.o elt_algELT_ALG1548486913.o elt_algELT_ALG241706736.o elt_algELT_ALG433952755.o elt_algELT_ALG656599769.o elt_algELT_ALG987448979.o flistFLISTAM_C1171004157.o flistFLISTTUPA253333040.o fmapFMAPAM_ROU1000508936.o fmapFMAPSTRFSE258056667.o fmapFMAPdTPCOD1051074108.o generate_amGEN60284023.o get_optionsCOD183550016.o globals.o get_optionsCOD183550016x.o implIMPL_CREAT99472218.o inlineINLINE_I1557365391.o intiINTI1462257232.o layoutCLASS_LA1330944056.o mangleMANGLE1705139666.o mangleNAMESPAC760510184.o o_localOPT_LOC907909712.o o_localOPT_LOC907909712x.o optimizeOPT_CO1177876774.o optimizeOPT_IT1193060919.o parsePARSER311504339.o parsePARSER311504339x.o parsePARSER311504339xx.o parsePARSER311504339xxx.o parsePARSER311504339xxxx.o progPROG_AS_TB824135997.o scanSCANNER1990933774.o side_effectSE_411721069.o strings.o stringsx.o stringsxx.o system.o stmtAM_FORK_ST1674905658.o tpTP_BUILTIN1142074570.o tpTP_ITER145455607.o transTRANS2123847391.o transTRANS2123847391x.o transTRANS2123847391xx.o transTRANS2123847391xxx.o transTRANS2123847391xxxx.o tupTUPAM_CURSO1313579705.o unbox.o unixUNIX1766692.o runtime.o  -L/usr/pkg/lib -Wl,-R/usr/pkg/lib -lgc -lm
gmake[1]: Leaving directory '/pbulk/work/lang/sather/work/sather-1.2.3/Bin/sacomp.code'
*************************************************************
        Trying to compile the optional Browser and Gui
*************************************************************
This step compiles the browser and provides the
        -dualgui and -debug_graphical compiler options:
If this step fails, it may be restarted by calling
      make optional
Requirements: 
     Tcl7.4 and Tk4.0 for the Browser and Gui
     Sockets for the -dualgui and the -debug_graphical option
See Doc/Installation.html for more details.
For errors, check:
      System/Platforms/tcltk/Platform.module 
      System/Platforms/X/Platform.module 
Also check System/Platforms/tcltk/startup.tcl
*************************************************************

/usr/pkg/bin/gmake browser
gmake[1]: Entering directory '/pbulk/work/lang/sather/work/sather-1.2.3'

Creating C for Browser...
Bin/sacomp -verbose -O_fast -O_no_move_while -O_no_hoist_const -O_no_cse -only_reachable Browser/browser.module -main BROWSER -o Bin/sabrowse -only_C
Initializing... (0 seconds)
Parsing non-library files... (0 seconds)
Finding types and parsing library... (0 seconds)
Type graph, conformance, main, init... (0 seconds)
Type check, generate, inline, optimize, and make C... (0 seconds)
Headers, writing C files... Regenerated 30 of 30 files... (0 seconds)
Compilation complete.

Compiling C for Browser...
/usr/pkg/bin/gmake -C Bin/sabrowse.code
gmake[2]: Entering directory '/pbulk/work/lang/sather/work/sather-1.2.3/Bin/sabrowse.code'
gcc -I/usr/X11R7/include -I/usr/pkg/include/gc -L/usr/pkg/lib -Wl,-R/usr/pkg/lib -I/usr/pkg/include -I/usr/pkg/include -Wl,-R/usr/X11R7/lib -L/usr/X11R7/lib -Wl,-R/usr/pkg/lib -L/usr/pkg/lib -Wl,-R/usr/pkg/lib -L/usr/pkg/lib -I.  -O2  -I/usr/X11R7/include -Wl,-R/usr/X11R7/lib -L/usr/X11R7/lib -I/pbulk/work/lang/sather/work/sather-1.2.3/System/Common -I/usr/pkg/include -I/usr/X11R7/include -I/usr/include -I/usr/pkg/include/freetype2  -c -o a_queueA_QUEUE1866281449.o a_queueA_QUEUE1866281449.c
a_queueA_QUEUE1866281449.c: In function 'A_QUEU2083402178':
a_queueA_QUEUE1866281449.c:7375:3: warning: 'return' with no value, in function returning non-void
 7375 |   return;
      |   ^~~~~~
a_queueA_QUEUE1866281449.c:7350:5: note: declared here
 7350 | STR A_QUEU2083402178(A_QUEU2083402178_frame frame) {
      |     ^~~~~~~~~~~~~~~~
gcc -I/usr/X11R7/include -I/usr/pkg/include/gc -L/usr/pkg/lib -Wl,-R/usr/pkg/lib -I/usr/pkg/include -I/usr/pkg/include -Wl,-R/usr/X11R7/lib -L/usr/X11R7/lib -Wl,-R/usr/pkg/lib -L/usr/pkg/lib -Wl,-R/usr/pkg/lib -L/usr/pkg/lib -I.  -O2  -I/usr/X11R7/include -Wl,-R/usr/X11R7/lib -L/usr/X11R7/lib -I/pbulk/work/lang/sather/work/sather-1.2.3/System/Common -I/usr/pkg/include -I/usr/X11R7/include -I/usr/include -I/usr/pkg/include/freetype2  -c -o arrayARRAYIDEN942453213.o arrayARRAYIDEN942453213.c
gcc -I/usr/X11R7/include -I/usr/pkg/include/gc -L/usr/pkg/lib -Wl,-R/usr/pkg/lib -I/usr/pkg/include -I/usr/pkg/include -Wl,-R/usr/X11R7/lib -L/usr/X11R7/lib -Wl,-R/usr/pkg/lib -L/usr/pkg/lib -Wl,-R/usr/pkg/lib -L/usr/pkg/lib -I.  -O2  -I/usr/X11R7/include -Wl,-R/usr/X11R7/lib -L/usr/X11R7/lib -I/pbulk/work/lang/sather/work/sather-1.2.3/System/Common -I/usr/pkg/include -I/usr/X11R7/include -I/usr/include -I/usr/pkg/include/freetype2  -c -o browserBROWSER1911301995.o browserBROWSER1911301995.c
gcc -I/usr/X11R7/include -I/usr/pkg/include/gc -L/usr/pkg/lib -Wl,-R/usr/pkg/lib -I/usr/pkg/include -I/usr/pkg/include -Wl,-R/usr/X11R7/lib -L/usr/X11R7/lib -Wl,-R/usr/pkg/lib -L/usr/pkg/lib -Wl,-R/usr/pkg/lib -L/usr/pkg/lib -I.  -O2  -I/usr/X11R7/include -Wl,-R/usr/X11R7/lib -L/usr/X11R7/lib -I/pbulk/work/lang/sather/work/sather-1.2.3/System/Common -I/usr/pkg/include -I/usr/X11R7/include -I/usr/include -I/usr/pkg/include/freetype2  -c -o browserFRONT_E942253381.o browserFRONT_E942253381.c
gcc -I/usr/X11R7/include -I/usr/pkg/include/gc -L/usr/pkg/lib -Wl,-R/usr/pkg/lib -I/usr/pkg/include -I/usr/pkg/include -Wl,-R/usr/X11R7/lib -L/usr/X11R7/lib -Wl,-R/usr/pkg/lib -L/usr/pkg/lib -Wl,-R/usr/pkg/lib -L/usr/pkg/lib -I.  -O2  -I/usr/X11R7/include -Wl,-R/usr/X11R7/lib -L/usr/X11R7/lib -I/pbulk/work/lang/sather/work/sather-1.2.3/System/Common -I/usr/pkg/include -I/usr/X11R7/include -I/usr/include -I/usr/pkg/include/freetype2  -c -o configCONFIG_R422014871.o configCONFIG_R422014871.c
configCONFIG_R422014871.c: In function 'CONFIG1589956977':
configCONFIG_R422014871.c:5873:4: warning: 'return' with no value, in function returning non-void
 5873 |    return;
      |    ^~~~~~
configCONFIG_R422014871.c:5845:10: note: declared here
 5845 | FLISTSTR CONFIG1589956977(CONFIG1589956977_frame frame) {
      |          ^~~~~~~~~~~~~~~~
configCONFIG_R422014871.c: In function 'CONFIG875430285':
configCONFIG_R422014871.c:5951:4: warning: 'return' with no value, in function returning non-void
 5951 |    return;
      |    ^~~~~~
configCONFIG_R422014871.c:5892:5: note: declared here
 5892 | STR CONFIG875430285(CONFIG875430285_frame frame) {
      |     ^~~~~~~~~~~~~~~
gcc -I/usr/X11R7/include -I/usr/pkg/include/gc -L/usr/pkg/lib -Wl,-R/usr/pkg/lib -I/usr/pkg/include -I/usr/pkg/include -Wl,-R/usr/X11R7/lib -L/usr/X11R7/lib -Wl,-R/usr/pkg/lib -L/usr/pkg/lib -Wl,-R/usr/pkg/lib -L/usr/pkg/lib -I.  -O2  -I/usr/X11R7/include -Wl,-R/usr/X11R7/lib -L/usr/X11R7/lib -I/pbulk/work/lang/sather/work/sather-1.2.3/System/Common -I/usr/pkg/include -I/usr/X11R7/include -I/usr/include -I/usr/pkg/include/freetype2  -c -o digraph_auxDIG1185206146.o digraph_auxDIG1185206146.c
gcc -I/usr/X11R7/include -I/usr/pkg/include/gc -L/usr/pkg/lib -Wl,-R/usr/pkg/lib -I/usr/pkg/include -I/usr/pkg/include -Wl,-R/usr/X11R7/lib -L/usr/X11R7/lib -Wl,-R/usr/pkg/lib -L/usr/pkg/lib -Wl,-R/usr/pkg/lib -L/usr/pkg/lib -I.  -O2  -I/usr/X11R7/include -Wl,-R/usr/X11R7/lib -L/usr/X11R7/lib -I/pbulk/work/lang/sather/work/sather-1.2.3/System/Common -I/usr/pkg/include -I/usr/X11R7/include -I/usr/include -I/usr/pkg/include/freetype2  -c -o eltELT742463773.o eltELT742463773.c
gcc -I/usr/X11R7/include -I/usr/pkg/include/gc -L/usr/pkg/lib -Wl,-R/usr/pkg/lib -I/usr/pkg/include -I/usr/pkg/include -Wl,-R/usr/X11R7/lib -L/usr/X11R7/lib -Wl,-R/usr/pkg/lib -L/usr/pkg/lib -Wl,-R/usr/pkg/lib -L/usr/pkg/lib -I.  -O2  -I/usr/X11R7/include -Wl,-R/usr/X11R7/lib -L/usr/X11R7/lib -I/pbulk/work/lang/sather/work/sather-1.2.3/System/Common -I/usr/pkg/include -I/usr/X11R7/include -I/usr/include -I/usr/pkg/include/freetype2  -c -o elt_algELT_ALG57220414.o elt_algELT_ALG57220414.c
gcc -I/usr/X11R7/include -I/usr/pkg/include/gc -L/usr/pkg/lib -Wl,-R/usr/pkg/lib -I/usr/pkg/include -I/usr/pkg/include -Wl,-R/usr/X11R7/lib -L/usr/X11R7/lib -Wl,-R/usr/pkg/lib -L/usr/pkg/lib -Wl,-R/usr/pkg/lib -L/usr/pkg/lib -I.  -O2  -I/usr/X11R7/include -Wl,-R/usr/X11R7/lib -L/usr/X11R7/lib -I/pbulk/work/lang/sather/work/sather-1.2.3/System/Common -I/usr/pkg/include -I/usr/X11R7/include -I/usr/include -I/usr/pkg/include/freetype2  -c -o flistFLISTTUPS2122968660.o flistFLISTTUPS2122968660.c
In file included from /pbulk/work/lang/sather/work/sather-1.2.3/System/Platforms/netbsd/../../Common/c_header.h:239,
                 from /pbulk/work/lang/sather/work/sather-1.2.3/System/Platforms/netbsd/header.h:8,
                 from sather.h:6,
                 from flistFLISTTUPS2122968660.c:1:
flistFLISTTUPS2122968660.c: In function 'r_signaling_nan':
flistFLISTTUPS2122968660.c:922:9: warning: implicit declaration of function 'signaling_nan'; did you mean 'r_signaling_nan'? [-Wimplicit-function-declaration]
  922 | _FM_F_I(signaling_nan)
      |         ^~~~~~~~~~~~~
/pbulk/work/lang/sather/work/sather-1.2.3/System/Platforms/netbsd/../../Common/floatmath.h:110:60: note: in definition of macro '_FM_F_I'
  110 | #define _FM_F_I(name)  static FLT r_##name(INT i) { return name(i); }
      |                                                            ^~~~
gcc -I/usr/X11R7/include -I/usr/pkg/include/gc -L/usr/pkg/lib -Wl,-R/usr/pkg/lib -I/usr/pkg/include -I/usr/pkg/include -Wl,-R/usr/X11R7/lib -L/usr/X11R7/lib -Wl,-R/usr/pkg/lib -L/usr/pkg/lib -Wl,-R/usr/pkg/lib -L/usr/pkg/lib -I.  -O2  -I/usr/X11R7/include -Wl,-R/usr/X11R7/lib -L/usr/X11R7/lib -I/pbulk/work/lang/sather/work/sather-1.2.3/System/Common -I/usr/pkg/include -I/usr/X11R7/include -I/usr/include -I/usr/pkg/include/freetype2  -c -o fmapFMAPTP_CLA1280087390.o fmapFMAPTP_CLA1280087390.c
fmapFMAPTP_CLA1280087390.c: In function 'ELT_TB431570775':
fmapFMAPTP_CLA1280087390.c:5677:3: warning: 'return' with no value, in function returning non-void
 5677 |   return;
      |   ^~~~~~
fmapFMAPTP_CLA1280087390.c:5647:5: note: declared here
 5647 | ELT ELT_TB431570775(ELT_TB431570775_frame frame) {
      |     ^~~~~~~~~~~~~~~
fmapFMAPTP_CLA1280087390.c: In function 'SIG_TB788365833':
fmapFMAPTP_CLA1280087390.c:5993:3: warning: 'return' with no value, in function returning non-void
 5993 |   return;
      |   ^~~~~~
fmapFMAPTP_CLA1280087390.c:5963:5: note: declared here
 5963 | SIG SIG_TB788365833(SIG_TB788365833_frame frame) {
      |     ^~~~~~~~~~~~~~~
gcc -I/usr/X11R7/include -I/usr/pkg/include/gc -L/usr/pkg/lib -Wl,-R/usr/pkg/lib -I/usr/pkg/include -I/usr/pkg/include -Wl,-R/usr/X11R7/lib -L/usr/X11R7/lib -Wl,-R/usr/pkg/lib -L/usr/pkg/lib -Wl,-R/usr/pkg/lib -L/usr/pkg/lib -I.  -O2  -I/usr/X11R7/include -Wl,-R/usr/X11R7/lib -L/usr/X11R7/lib -I/pbulk/work/lang/sather/work/sather-1.2.3/System/Common -I/usr/pkg/include -I/usr/X11R7/include -I/usr/include -I/usr/pkg/include/freetype2  -c -o globals.o globals.c
gcc -I/usr/X11R7/include -I/usr/pkg/include/gc -L/usr/pkg/lib -Wl,-R/usr/pkg/lib -I/usr/pkg/include -I/usr/pkg/include -Wl,-R/usr/X11R7/lib -L/usr/X11R7/lib -Wl,-R/usr/pkg/lib -L/usr/pkg/lib -Wl,-R/usr/pkg/lib -L/usr/pkg/lib -I.  -O2  -I/usr/X11R7/include -Wl,-R/usr/X11R7/lib -L/usr/X11R7/lib -I/pbulk/work/lang/sather/work/sather-1.2.3/System/Common -I/usr/pkg/include -I/usr/X11R7/include -I/usr/include -I/usr/pkg/include/freetype2  -c -o get_optionsBRO516081173.o get_optionsBRO516081173.c
gcc -I/usr/X11R7/include -I/usr/pkg/include/gc -L/usr/pkg/lib -Wl,-R/usr/pkg/lib -I/usr/pkg/include -I/usr/pkg/include -Wl,-R/usr/X11R7/lib -L/usr/X11R7/lib -Wl,-R/usr/pkg/lib -L/usr/pkg/lib -Wl,-R/usr/pkg/lib -L/usr/pkg/lib -I.  -O2  -I/usr/X11R7/include -Wl,-R/usr/X11R7/lib -L/usr/X11R7/lib -I/pbulk/work/lang/sather/work/sather-1.2.3/System/Common -I/usr/pkg/include -I/usr/X11R7/include -I/usr/include -I/usr/pkg/include/freetype2  -c -o identIDENT_BUI479051499.o identIDENT_BUI479051499.c
gcc -I/usr/X11R7/include -I/usr/pkg/include/gc -L/usr/pkg/lib -Wl,-R/usr/pkg/lib -I/usr/pkg/include -I/usr/pkg/include -Wl,-R/usr/X11R7/lib -L/usr/X11R7/lib -Wl,-R/usr/pkg/lib -L/usr/pkg/lib -Wl,-R/usr/pkg/lib -L/usr/pkg/lib -I.  -O2  -I/usr/X11R7/include -Wl,-R/usr/X11R7/lib -L/usr/X11R7/lib -I/pbulk/work/lang/sather/work/sather-1.2.3/System/Common -I/usr/pkg/include -I/usr/X11R7/include -I/usr/include -I/usr/pkg/include/freetype2  -c -o intiINTI1462257232.o intiINTI1462257232.c
gcc -I/usr/X11R7/include -I/usr/pkg/include/gc -L/usr/pkg/lib -Wl,-R/usr/pkg/lib -I/usr/pkg/include -I/usr/pkg/include -Wl,-R/usr/X11R7/lib -L/usr/X11R7/lib -Wl,-R/usr/pkg/lib -L/usr/pkg/lib -Wl,-R/usr/pkg/lib -L/usr/pkg/lib -I.  -O2  -I/usr/X11R7/include -Wl,-R/usr/X11R7/lib -L/usr/X11R7/lib -I/pbulk/work/lang/sather/work/sather-1.2.3/System/Common -I/usr/pkg/include -I/usr/X11R7/include -I/usr/include -I/usr/pkg/include/freetype2  -c -o parsePARSER311504339.o parsePARSER311504339.c
gcc -I/usr/X11R7/include -I/usr/pkg/include/gc -L/usr/pkg/lib -Wl,-R/usr/pkg/lib -I/usr/pkg/include -I/usr/pkg/include -Wl,-R/usr/X11R7/lib -L/usr/X11R7/lib -Wl,-R/usr/pkg/lib -L/usr/pkg/lib -Wl,-R/usr/pkg/lib -L/usr/pkg/lib -I.  -O2  -I/usr/X11R7/include -Wl,-R/usr/X11R7/lib -L/usr/X11R7/lib -I/pbulk/work/lang/sather/work/sather-1.2.3/System/Common -I/usr/pkg/include -I/usr/X11R7/include -I/usr/include -I/usr/pkg/include/freetype2  -c -o parsePARSER311504339x.o parsePARSER311504339x.c
gcc -I/usr/X11R7/include -I/usr/pkg/include/gc -L/usr/pkg/lib -Wl,-R/usr/pkg/lib -I/usr/pkg/include -I/usr/pkg/include -Wl,-R/usr/X11R7/lib -L/usr/X11R7/lib -Wl,-R/usr/pkg/lib -L/usr/pkg/lib -Wl,-R/usr/pkg/lib -L/usr/pkg/lib -I.  -O2  -I/usr/X11R7/include -Wl,-R/usr/X11R7/lib -L/usr/X11R7/lib -I/pbulk/work/lang/sather/work/sather-1.2.3/System/Common -I/usr/pkg/include -I/usr/X11R7/include -I/usr/include -I/usr/pkg/include/freetype2  -c -o parsePARSER311504339xx.o parsePARSER311504339xx.c
gcc -I/usr/X11R7/include -I/usr/pkg/include/gc -L/usr/pkg/lib -Wl,-R/usr/pkg/lib -I/usr/pkg/include -I/usr/pkg/include -Wl,-R/usr/X11R7/lib -L/usr/X11R7/lib -Wl,-R/usr/pkg/lib -L/usr/pkg/lib -Wl,-R/usr/pkg/lib -L/usr/pkg/lib -I.  -O2  -I/usr/X11R7/include -Wl,-R/usr/X11R7/lib -L/usr/X11R7/lib -I/pbulk/work/lang/sather/work/sather-1.2.3/System/Common -I/usr/pkg/include -I/usr/X11R7/include -I/usr/include -I/usr/pkg/include/freetype2  -c -o parsePARSER311504339xxx.o parsePARSER311504339xxx.c
gcc -I/usr/X11R7/include -I/usr/pkg/include/gc -L/usr/pkg/lib -Wl,-R/usr/pkg/lib -I/usr/pkg/include -I/usr/pkg/include -Wl,-R/usr/X11R7/lib -L/usr/X11R7/lib -Wl,-R/usr/pkg/lib -L/usr/pkg/lib -Wl,-R/usr/pkg/lib -L/usr/pkg/lib -I.  -O2  -I/usr/X11R7/include -Wl,-R/usr/X11R7/lib -L/usr/X11R7/lib -I/pbulk/work/lang/sather/work/sather-1.2.3/System/Common -I/usr/pkg/include -I/usr/X11R7/include -I/usr/include -I/usr/pkg/include/freetype2  -c -o parsePARSER311504339xxxx.o parsePARSER311504339xxxx.c
gcc -I/usr/X11R7/include -I/usr/pkg/include/gc -L/usr/pkg/lib -Wl,-R/usr/pkg/lib -I/usr/pkg/include -I/usr/pkg/include -Wl,-R/usr/X11R7/lib -L/usr/X11R7/lib -Wl,-R/usr/pkg/lib -L/usr/pkg/lib -Wl,-R/usr/pkg/lib -L/usr/pkg/lib -I.  -O2  -I/usr/X11R7/include -Wl,-R/usr/X11R7/lib -L/usr/X11R7/lib -I/pbulk/work/lang/sather/work/sather-1.2.3/System/Common -I/usr/pkg/include -I/usr/X11R7/include -I/usr/include -I/usr/pkg/include/freetype2  -c -o strings.o strings.c
gcc -I/usr/X11R7/include -I/usr/pkg/include/gc -L/usr/pkg/lib -Wl,-R/usr/pkg/lib -I/usr/pkg/include -I/usr/pkg/include -Wl,-R/usr/X11R7/lib -L/usr/X11R7/lib -Wl,-R/usr/pkg/lib -L/usr/pkg/lib -Wl,-R/usr/pkg/lib -L/usr/pkg/lib -I.  -O2  -I/usr/X11R7/include -Wl,-R/usr/X11R7/lib -L/usr/X11R7/lib -I/pbulk/work/lang/sather/work/sather-1.2.3/System/Common -I/usr/pkg/include -I/usr/X11R7/include -I/usr/include -I/usr/pkg/include/freetype2  -c -o system.o system.c
gcc -I/usr/X11R7/include -I/usr/pkg/include/gc -L/usr/pkg/lib -Wl,-R/usr/pkg/lib -I/usr/pkg/include -I/usr/pkg/include -Wl,-R/usr/X11R7/lib -L/usr/X11R7/lib -Wl,-R/usr/pkg/lib -L/usr/pkg/lib -Wl,-R/usr/pkg/lib -L/usr/pkg/lib -I.  -O2  -I/usr/X11R7/include -Wl,-R/usr/X11R7/lib -L/usr/X11R7/lib -I/pbulk/work/lang/sather/work/sather-1.2.3/System/Common -I/usr/pkg/include -I/usr/X11R7/include -I/usr/include -I/usr/pkg/include/freetype2  -c -o sigSIG1392078333.o sigSIG1392078333.c
gcc -I/usr/X11R7/include -I/usr/pkg/include/gc -L/usr/pkg/lib -Wl,-R/usr/pkg/lib -I/usr/pkg/include -I/usr/pkg/include -Wl,-R/usr/X11R7/lib -L/usr/X11R7/lib -Wl,-R/usr/pkg/lib -L/usr/pkg/lib -Wl,-R/usr/pkg/lib -L/usr/pkg/lib -I.  -O2  -I/usr/X11R7/include -Wl,-R/usr/X11R7/lib -L/usr/X11R7/lib -I/pbulk/work/lang/sather/work/sather-1.2.3/System/Common -I/usr/pkg/include -I/usr/X11R7/include -I/usr/include -I/usr/pkg/include/freetype2  -c -o tpTP_CLASS1515386274.o tpTP_CLASS1515386274.c
gcc -I/usr/X11R7/include -I/usr/pkg/include/gc -L/usr/pkg/lib -Wl,-R/usr/pkg/lib -I/usr/pkg/include -I/usr/pkg/include -Wl,-R/usr/X11R7/lib -L/usr/X11R7/lib -Wl,-R/usr/pkg/lib -L/usr/pkg/lib -Wl,-R/usr/pkg/lib -L/usr/pkg/lib -I.  -O2  -I/usr/X11R7/include -Wl,-R/usr/X11R7/lib -L/usr/X11R7/lib -I/pbulk/work/lang/sather/work/sather-1.2.3/System/Common -I/usr/pkg/include -I/usr/X11R7/include -I/usr/include -I/usr/pkg/include/freetype2  -c -o tpTP_ITER_TBL2079712296.o tpTP_ITER_TBL2079712296.c
gcc -I/usr/X11R7/include -I/usr/pkg/include/gc -L/usr/pkg/lib -Wl,-R/usr/pkg/lib -I/usr/pkg/include -I/usr/pkg/include -Wl,-R/usr/X11R7/lib -L/usr/X11R7/lib -Wl,-R/usr/pkg/lib -L/usr/pkg/lib -Wl,-R/usr/pkg/lib -L/usr/pkg/lib -I.  -O2  -I/usr/X11R7/include -Wl,-R/usr/X11R7/lib -L/usr/X11R7/lib -I/pbulk/work/lang/sather/work/sather-1.2.3/System/Common -I/usr/pkg/include -I/usr/X11R7/include -I/usr/include -I/usr/pkg/include/freetype2  -c -o unbox.o unbox.c
gcc -I/usr/X11R7/include -I/usr/pkg/include/gc -L/usr/pkg/lib -Wl,-R/usr/pkg/lib -I/usr/pkg/include -I/usr/pkg/include -Wl,-R/usr/X11R7/lib -L/usr/X11R7/lib -Wl,-R/usr/pkg/lib -L/usr/pkg/lib -Wl,-R/usr/pkg/lib -L/usr/pkg/lib -I.  -O2  -I/usr/X11R7/include -Wl,-R/usr/X11R7/lib -L/usr/X11R7/lib -I/pbulk/work/lang/sather/work/sather-1.2.3/System/Common -c /pbulk/work/lang/sather/work/sather-1.2.3/System/Common/runtime.c
gcc -I/usr/X11R7/include -I/usr/pkg/include/gc -L/usr/pkg/lib -Wl,-R/usr/pkg/lib -I/usr/pkg/include -I/usr/pkg/include -Wl,-R/usr/X11R7/lib -L/usr/X11R7/lib -Wl,-R/usr/pkg/lib -L/usr/pkg/lib -Wl,-R/usr/pkg/lib -L/usr/pkg/lib -I.  -O2  -I/usr/X11R7/include -Wl,-R/usr/X11R7/lib -L/usr/X11R7/lib -I/pbulk/work/lang/sather/work/sather-1.2.3/System/Common -c /pbulk/work/lang/sather/work/sather-1.2.3/Library/System/TclTk/c_interface.c
/pbulk/work/lang/sather/work/sather-1.2.3/Library/System/TclTk/c_interface.c: In function 'to_int':
/pbulk/work/lang/sather/work/sather-1.2.3/Library/System/TclTk/c_interface.c:19:11: warning: cast from pointer to integer of different size [-Wpointer-to-int-cast]
   19 |   return ((int) tcl);
      |           ^
/pbulk/work/lang/sather/work/sather-1.2.3/Library/System/TclTk/c_interface.c: In function 'tkkit_cb_cmd':
/pbulk/work/lang/sather/work/sather-1.2.3/Library/System/TclTk/c_interface.c:37:3: warning: implicit declaration of function 'C_TCL_TK_tkkit_cb' [-Wimplicit-function-declaration]
   37 |   C_TCL_TK_tkkit_cb(argv);
      |   ^~~~~~~~~~~~~~~~~
/pbulk/work/lang/sather/work/sather-1.2.3/Library/System/TclTk/c_interface.c: In function 'sather_cmd':
/pbulk/work/lang/sather/work/sather-1.2.3/Library/System/TclTk/c_interface.c:41:10: warning: implicit declaration of function 'C_TCL_TK_sather_cb' [-Wimplicit-function-declaration]
   41 |   return C_TCL_TK_sather_cb((int) tcl, argv);
      |          ^~~~~~~~~~~~~~~~~~
/pbulk/work/lang/sather/work/sather-1.2.3/Library/System/TclTk/c_interface.c:41:29: warning: cast from pointer to integer of different size [-Wpointer-to-int-cast]
   41 |   return C_TCL_TK_sather_cb((int) tcl, argv);
      |                             ^
/pbulk/work/lang/sather/work/sather-1.2.3/Library/System/TclTk/c_interface.c: In function 'init_raster':
/pbulk/work/lang/sather/work/sather-1.2.3/Library/System/TclTk/c_interface.c:60:3: warning: implicit declaration of function 'Tk_AddRaster' [-Wimplicit-function-declaration]
   60 |   Tk_AddRaster(tcl);
      |   ^~~~~~~~~~~~
/pbulk/work/lang/sather/work/sather-1.2.3/Library/System/TclTk/c_interface.c: In function 'Tcl_GetResult':
/pbulk/work/lang/sather/work/sather-1.2.3/Library/System/TclTk/c_interface.c:69:10: warning: return discards 'const' qualifier from pointer target type [-Wdiscarded-qualifiers]
   69 |   return Tcl_GetStringResult(interpreter);
      |          ^~~~~~~~~~~~~~~~~~~~~~~~~~~~~~~~
gcc -I/usr/X11R7/include -I/usr/pkg/include/gc -L/usr/pkg/lib -Wl,-R/usr/pkg/lib -I/usr/pkg/include -I/usr/pkg/include -Wl,-R/usr/X11R7/lib -L/usr/X11R7/lib -Wl,-R/usr/pkg/lib -L/usr/pkg/lib -Wl,-R/usr/pkg/lib -L/usr/pkg/lib -I.  -O2  -I/usr/X11R7/include -Wl,-R/usr/X11R7/lib -L/usr/X11R7/lib -I/pbulk/work/lang/sather/work/sather-1.2.3/System/Common -c /pbulk/work/lang/sather/work/sather-1.2.3/Library/System/TclTk/c_raster.c
gcc -I/usr/X11R7/include -I/usr/pkg/include/gc -L/usr/pkg/lib -Wl,-R/usr/pkg/lib -I/usr/pkg/include -I/usr/pkg/include -Wl,-R/usr/X11R7/lib -L/usr/X11R7/lib -Wl,-R/usr/pkg/lib -L/usr/pkg/lib -Wl,-R/usr/pkg/lib -L/usr/pkg/lib -I.  -O2  -I/usr/X11R7/include -Wl,-R/usr/X11R7/lib -L/usr/X11R7/lib -I/pbulk/work/lang/sather/work/sather-1.2.3/System/Common -c /pbulk/work/lang/sather/work/sather-1.2.3/Library/System/TclTk/tkRaster.c
/pbulk/work/lang/sather/work/sather-1.2.3/Library/System/TclTk/tkRaster.c: In function 'RasterCmd':
/pbulk/work/lang/sather/work/sather-1.2.3/Library/System/TclTk/tkRaster.c:499:5: warning: 'result' is deprecated: use Tcl_GetStringResult/Tcl_SetResult [-Wdeprecated-declarations]
  499 |     interp->result = Tk_PathName(RasterPtr->tkwin);
      |     ^~~~~~
In file included from /pbulk/work/lang/sather/work/.x11-buildlink/include/tk.h:19,
                 from /pbulk/work/lang/sather/work/sather-1.2.3/Library/System/TclTk/tkRaster.c:55:
/pbulk/work/lang/sather/work/.x11-buildlink/include/tcl.h:513:11: note: declared here
  513 |     char *result TCL_DEPRECATED_API("use Tcl_GetStringResult/Tcl_SetResult");
      |           ^~~~~~
/pbulk/work/lang/sather/work/sather-1.2.3/Library/System/TclTk/tkRaster.c: In function 'RasterWidgetCmd':
/pbulk/work/lang/sather/work/sather-1.2.3/Library/System/TclTk/tkRaster.c:678:4: warning: 'result' is deprecated: use Tcl_GetStringResult/Tcl_SetResult [-Wdeprecated-declarations]
  678 |    sprintf (interp->result, "%d", RasterPtr->currentDrawEnv->index);
      |    ^~~~~~~
In file included from /pbulk/work/lang/sather/work/.x11-buildlink/include/tk.h:19,
                 from /pbulk/work/lang/sather/work/sather-1.2.3/Library/System/TclTk/tkRaster.c:55:
/pbulk/work/lang/sather/work/.x11-buildlink/include/tcl.h:513:11: note: declared here
  513 |     char *result TCL_DEPRECATED_API("use Tcl_GetStringResult/Tcl_SetResult");
      |           ^~~~~~
/pbulk/work/lang/sather/work/sather-1.2.3/Library/System/TclTk/tkRaster.c:678:4: warning: 'result' is deprecated: use Tcl_GetStringResult/Tcl_SetResult [-Wdeprecated-declarations]
  678 |    sprintf (interp->result, "%d", RasterPtr->currentDrawEnv->index);
      |    ^~~~~~~
In file included from /pbulk/work/lang/sather/work/.x11-buildlink/include/tk.h:19,
                 from /pbulk/work/lang/sather/work/sather-1.2.3/Library/System/TclTk/tkRaster.c:55:
/pbulk/work/lang/sather/work/.x11-buildlink/include/tcl.h:513:11: note: declared here
  513 |     char *result TCL_DEPRECATED_API("use Tcl_GetStringResult/Tcl_SetResult");
      |           ^~~~~~
/pbulk/work/lang/sather/work/sather-1.2.3/Library/System/TclTk/tkRaster.c:740:4: warning: 'result' is deprecated: use Tcl_GetStringResult/Tcl_SetResult [-Wdeprecated-declarations]
  740 |    sprintf (interp->result, "%0.9g %0.9g %0.9g %0.9g",
      |    ^~~~~~~
In file included from /pbulk/work/lang/sather/work/.x11-buildlink/include/tk.h:19,
                 from /pbulk/work/lang/sather/work/sather-1.2.3/Library/System/TclTk/tkRaster.c:55:
/pbulk/work/lang/sather/work/.x11-buildlink/include/tcl.h:513:11: note: declared here
  513 |     char *result TCL_DEPRECATED_API("use Tcl_GetStringResult/Tcl_SetResult");
      |           ^~~~~~
/pbulk/work/lang/sather/work/sather-1.2.3/Library/System/TclTk/tkRaster.c:740:4: warning: 'result' is deprecated: use Tcl_GetStringResult/Tcl_SetResult [-Wdeprecated-declarations]
  740 |    sprintf (interp->result, "%0.9g %0.9g %0.9g %0.9g",
      |    ^~~~~~~
In file included from /pbulk/work/lang/sather/work/.x11-buildlink/include/tk.h:19,
                 from /pbulk/work/lang/sather/work/sather-1.2.3/Library/System/TclTk/tkRaster.c:55:
/pbulk/work/lang/sather/work/.x11-buildlink/include/tcl.h:513:11: note: declared here
  513 |     char *result TCL_DEPRECATED_API("use Tcl_GetStringResult/Tcl_SetResult");
      |           ^~~~~~
/pbulk/work/lang/sather/work/sather-1.2.3/Library/System/TclTk/tkRaster.c:779:8: warning: 'result' is deprecated: use Tcl_GetStringResult/Tcl_SetResult [-Wdeprecated-declarations]
  779 |        sprintf (interp->result, "%0.9g %0.9g", x0, y0);
      |        ^~~~~~~
In file included from /pbulk/work/lang/sather/work/.x11-buildlink/include/tk.h:19,
                 from /pbulk/work/lang/sather/work/sather-1.2.3/Library/System/TclTk/tkRaster.c:55:
/pbulk/work/lang/sather/work/.x11-buildlink/include/tcl.h:513:11: note: declared here
  513 |     char *result TCL_DEPRECATED_API("use Tcl_GetStringResult/Tcl_SetResult");
      |           ^~~~~~
/pbulk/work/lang/sather/work/sather-1.2.3/Library/System/TclTk/tkRaster.c:779:8: warning: 'result' is deprecated: use Tcl_GetStringResult/Tcl_SetResult [-Wdeprecated-declarations]
  779 |        sprintf (interp->result, "%0.9g %0.9g", x0, y0);
      |        ^~~~~~~
In file included from /pbulk/work/lang/sather/work/.x11-buildlink/include/tk.h:19,
                 from /pbulk/work/lang/sather/work/sather-1.2.3/Library/System/TclTk/tkRaster.c:55:
/pbulk/work/lang/sather/work/.x11-buildlink/include/tcl.h:513:11: note: declared here
  513 |     char *result TCL_DEPRECATED_API("use Tcl_GetStringResult/Tcl_SetResult");
      |           ^~~~~~
/pbulk/work/lang/sather/work/sather-1.2.3/Library/System/TclTk/tkRaster.c:794:8: warning: 'result' is deprecated: use Tcl_GetStringResult/Tcl_SetResult [-Wdeprecated-declarations]
  794 |        sprintf (interp->result, "%d %d", rx, ry);
      |        ^~~~~~~
In file included from /pbulk/work/lang/sather/work/.x11-buildlink/include/tk.h:19,
                 from /pbulk/work/lang/sather/work/sather-1.2.3/Library/System/TclTk/tkRaster.c:55:
/pbulk/work/lang/sather/work/.x11-buildlink/include/tcl.h:513:11: note: declared here
  513 |     char *result TCL_DEPRECATED_API("use Tcl_GetStringResult/Tcl_SetResult");
      |           ^~~~~~
/pbulk/work/lang/sather/work/sather-1.2.3/Library/System/TclTk/tkRaster.c:794:8: warning: 'result' is deprecated: use Tcl_GetStringResult/Tcl_SetResult [-Wdeprecated-declarations]
  794 |        sprintf (interp->result, "%d %d", rx, ry);
      |        ^~~~~~~
In file included from /pbulk/work/lang/sather/work/.x11-buildlink/include/tk.h:19,
                 from /pbulk/work/lang/sather/work/sather-1.2.3/Library/System/TclTk/tkRaster.c:55:
/pbulk/work/lang/sather/work/.x11-buildlink/include/tcl.h:513:11: note: declared here
  513 |     char *result TCL_DEPRECATED_API("use Tcl_GetStringResult/Tcl_SetResult");
      |           ^~~~~~
In file included from /pbulk/work/lang/sather/work/.x11-buildlink/include/tk.h:19,
                 from /pbulk/work/lang/sather/work/sather-1.2.3/Library/System/TclTk/tkRaster.c:55:
/pbulk/work/lang/sather/work/sather-1.2.3/Library/System/TclTk/tkRaster.c: In function 'DrawEnvIndex':
/pbulk/work/lang/sather/work/sather-1.2.3/Library/System/TclTk/tkRaster.c:1614:62: warning: cast to pointer from integer of different size [-Wint-to-pointer-cast]
 1614 |    entryPtr = Tcl_FindHashEntry (&(RasterPtr->drawEnvTable), (char*)drawenvno);
      |                                                              ^
/pbulk/work/lang/sather/work/.x11-buildlink/include/tcl.h:2570:53: note: in definition of macro 'Tcl_FindHashEntry'
 2570 |  (*((tablePtr)->findProc))(tablePtr, (const char *)(key))
      |                                                     ^~~
/pbulk/work/lang/sather/work/sather-1.2.3/Library/System/TclTk/tkRaster.c: In function 'CreateDrawEnv':
/pbulk/work/lang/sather/work/sather-1.2.3/Library/System/TclTk/tkRaster.c:1704:8: warning: cast to pointer from integer of different size [-Wint-to-pointer-cast]
 1704 |        (char*) (RasterPtr->drawEnvCount),
      |        ^
/pbulk/work/lang/sather/work/.x11-buildlink/include/tcl.h:2573:55: note: in definition of macro 'Tcl_CreateHashEntry'
 2573 |  (*((tablePtr)->createProc))(tablePtr, (const char *)(key), newPtr)
      |                                                       ^~~
/pbulk/work/lang/sather/work/sather-1.2.3/Library/System/TclTk/tkRaster.c:1716:4: warning: 'result' is deprecated: use Tcl_GetStringResult/Tcl_SetResult [-Wdeprecated-declarations]
 1716 |    sprintf (interp->result, "%d", RasterPtr->drawEnvCount++);
      |    ^~~~~~~
In file included from /pbulk/work/lang/sather/work/.x11-buildlink/include/tk.h:19,
                 from /pbulk/work/lang/sather/work/sather-1.2.3/Library/System/TclTk/tkRaster.c:55:
/pbulk/work/lang/sather/work/.x11-buildlink/include/tcl.h:513:11: note: declared here
  513 |     char *result TCL_DEPRECATED_API("use Tcl_GetStringResult/Tcl_SetResult");
      |           ^~~~~~
/pbulk/work/lang/sather/work/sather-1.2.3/Library/System/TclTk/tkRaster.c:1716:4: warning: 'result' is deprecated: use Tcl_GetStringResult/Tcl_SetResult [-Wdeprecated-declarations]
 1716 |    sprintf (interp->result, "%d", RasterPtr->drawEnvCount++);
      |    ^~~~~~~
In file included from /pbulk/work/lang/sather/work/.x11-buildlink/include/tk.h:19,
                 from /pbulk/work/lang/sather/work/sather-1.2.3/Library/System/TclTk/tkRaster.c:55:
/pbulk/work/lang/sather/work/.x11-buildlink/include/tcl.h:513:11: note: declared here
  513 |     char *result TCL_DEPRECATED_API("use Tcl_GetStringResult/Tcl_SetResult");
      |           ^~~~~~
In file included from /pbulk/work/lang/sather/work/.x11-buildlink/include/tk.h:19,
                 from /pbulk/work/lang/sather/work/sather-1.2.3/Library/System/TclTk/tkRaster.c:55:
/pbulk/work/lang/sather/work/sather-1.2.3/Library/System/TclTk/tkRaster.c: In function 'DestroyDrawEnv':
/pbulk/work/lang/sather/work/sather-1.2.3/Library/System/TclTk/tkRaster.c:1732:6: warning: cast to pointer from integer of different size [-Wint-to-pointer-cast]
 1732 |      (char*)(drawenvptr->index));
      |      ^
/pbulk/work/lang/sather/work/.x11-buildlink/include/tcl.h:2570:53: note: in definition of macro 'Tcl_FindHashEntry'
 2570 |  (*((tablePtr)->findProc))(tablePtr, (const char *)(key))
      |                                                     ^~~
/pbulk/work/lang/sather/work/sather-1.2.3/Library/System/TclTk/tkRaster.c: In function 'CreateDrawEnviron':
/pbulk/work/lang/sather/work/sather-1.2.3/Library/System/TclTk/tkRaster.c:2196:5: warning: 'result' is deprecated: use Tcl_GetStringResult/Tcl_SetResult [-Wdeprecated-declarations]
 2196 |     result = atoi(interp->result);
      |     ^~~~~~
In file included from /pbulk/work/lang/sather/work/.x11-buildlink/include/tk.h:19,
                 from /pbulk/work/lang/sather/work/sather-1.2.3/Library/System/TclTk/tkRaster.c:55:
/pbulk/work/lang/sather/work/.x11-buildlink/include/tcl.h:513:11: note: declared here
  513 |     char *result TCL_DEPRECATED_API("use Tcl_GetStringResult/Tcl_SetResult");
      |           ^~~~~~
gcc -I/usr/X11R7/include -I/usr/pkg/include/gc -L/usr/pkg/lib -Wl,-R/usr/pkg/lib -I/usr/pkg/include -I/usr/pkg/include -Wl,-R/usr/X11R7/lib -L/usr/X11R7/lib -Wl,-R/usr/pkg/lib -L/usr/pkg/lib -Wl,-R/usr/pkg/lib -L/usr/pkg/lib -I.  -O2  -I/usr/X11R7/include -Wl,-R/usr/X11R7/lib -L/usr/X11R7/lib -I/pbulk/work/lang/sather/work/sather-1.2.3/System/Common -c /pbulk/work/lang/sather/work/sather-1.2.3/Library/System/TclTk/tkRasterBuiltIn.c
/pbulk/work/lang/sather/work/sather-1.2.3/Library/System/TclTk/tkRasterBuiltIn.c: In function 'ParseCoords':
/pbulk/work/lang/sather/work/sather-1.2.3/Library/System/TclTk/tkRasterBuiltIn.c:38:15: warning: implicit declaration of function 'isdigit' [-Wimplicit-function-declaration]
   38 |  i < argc && (isdigit (argv [i][0]) ||
      |               ^~~~~~~
/pbulk/work/lang/sather/work/sather-1.2.3/Library/System/TclTk/tkRasterBuiltIn.c: In function 'DrawLine':
/pbulk/work/lang/sather/work/sather-1.2.3/Library/System/TclTk/tkRasterBuiltIn.c:88:11: warning: implicit declaration of function 'strncmp' [-Wimplicit-function-declaration]
   88 |       if (strncmp (argv [n+2], "-style", strlen (argv [n+2])) == 0) {
      |           ^~~~~~~
/pbulk/work/lang/sather/work/sather-1.2.3/Library/System/TclTk/tkRasterBuiltIn.c:88:42: warning: implicit declaration of function 'strlen' [-Wimplicit-function-declaration]
   88 |       if (strncmp (argv [n+2], "-style", strlen (argv [n+2])) == 0) {
      |                                          ^~~~~~
/pbulk/work/lang/sather/work/sather-1.2.3/Library/System/TclTk/tkRasterBuiltIn.c:88:42: warning: incompatible implicit declaration of built-in function 'strlen'
/pbulk/work/lang/sather/work/sather-1.2.3/Library/System/TclTk/tkRasterBuiltIn.c:18:1: note: include '<string.h>' or provide a declaration of 'strlen'
   17 | #include "tkRasterBuiltIn.h"
  +++ |+#include <string.h>
   18 | 
/pbulk/work/lang/sather/work/sather-1.2.3/Library/System/TclTk/tkRasterBuiltIn.c: In function 'DrawPoint':
/pbulk/work/lang/sather/work/sather-1.2.3/Library/System/TclTk/tkRasterBuiltIn.c:154:42: warning: incompatible implicit declaration of built-in function 'strlen'
  154 |       if (strncmp (argv [n+2], "-style", strlen (argv [n+2])) == 0) {
      |                                          ^~~~~~
/pbulk/work/lang/sather/work/sather-1.2.3/Library/System/TclTk/tkRasterBuiltIn.c:154:42: note: include '<string.h>' or provide a declaration of 'strlen'
/pbulk/work/lang/sather/work/sather-1.2.3/Library/System/TclTk/tkRasterBuiltIn.c: In function 'DrawRect':
/pbulk/work/lang/sather/work/sather-1.2.3/Library/System/TclTk/tkRasterBuiltIn.c:218:42: warning: incompatible implicit declaration of built-in function 'strlen'
  218 |       if (strncmp (argv [n+2], "-style", strlen (argv [n+2])) == 0) {
      |                                          ^~~~~~
/pbulk/work/lang/sather/work/sather-1.2.3/Library/System/TclTk/tkRasterBuiltIn.c:218:42: note: include '<string.h>' or provide a declaration of 'strlen'
gcc -I/usr/X11R7/include -I/usr/pkg/include/gc -L/usr/pkg/lib -Wl,-R/usr/pkg/lib -I/usr/pkg/include -I/usr/pkg/include -Wl,-R/usr/X11R7/lib -L/usr/X11R7/lib -Wl,-R/usr/pkg/lib -L/usr/pkg/lib -Wl,-R/usr/pkg/lib -L/usr/pkg/lib -I.  -O2  -I/usr/X11R7/include -Wl,-R/usr/X11R7/lib -L/usr/X11R7/lib -I/pbulk/work/lang/sather/work/sather-1.2.3/System/Common -o ../sabrowse a_queueA_QUEUE1866281449.o arrayARRAYIDEN942453213.o browserBROWSER1911301995.o browserFRONT_E942253381.o configCONFIG_R422014871.o digraph_auxDIG1185206146.o eltELT742463773.o elt_algELT_ALG57220414.o flistFLISTTUPS2122968660.o fmapFMAPTP_CLA1280087390.o globals.o get_optionsBRO516081173.o identIDENT_BUI479051499.o intiINTI1462257232.o parsePARSER311504339.o parsePARSER311504339x.o parsePARSER311504339xx.o parsePARSER311504339xxx.o parsePARSER311504339xxxx.o strings.o system.o sigSIG1392078333.o tpTP_CLASS1515386274.o tpTP_ITER_TBL2079712296.o unbox.o runtime.o c_interface.o c_raster.o tkRaster.o tkRasterBuiltIn.o  -ltcl86 -ltk86 -lX11 -L/usr/pkg/lib -Wl,-R/usr/pkg/lib -lgc -lm
gmake[2]: Leaving directory '/pbulk/work/lang/sather/work/sather-1.2.3/Bin/sabrowse.code'
gmake[1]: Leaving directory '/pbulk/work/lang/sather/work/sather-1.2.3'
/usr/pkg/bin/gmake dualgui
gmake[1]: Entering directory '/pbulk/work/lang/sather/work/sather-1.2.3'

Creating server end for two-process Gui...
****************************************************
Installing the server for the Dual process Gui, -dualgui
Required for use of the
     -dualgui and -debug_graphical
compiler options
See the notes in Doc/Installation.html for more details.
****************************************************
/usr/pkg/bin/gmake -C System/Platforms/dualgui
gmake[2]: Entering directory '/pbulk/work/lang/sather/work/sather-1.2.3/System/Platforms/dualgui'
/pbulk/work/lang/sather/work/sather-1.2.3/Bin/sacomp GuiServer.module -main GUI_SERVER_END -o dual_gui_server -verbose -output_C
signal 11 caught ... 
gmake[2]: *** [Makefile:16: all] Abort trap (core dumped)
gmake[2]: Leaving directory '/pbulk/work/lang/sather/work/sather-1.2.3/System/Platforms/dualgui'
gmake[1]: *** [Makefile:174: dualgui] Error 2
gmake[1]: Leaving directory '/pbulk/work/lang/sather/work/sather-1.2.3'
gmake: *** [Makefile:153: optional] Error 2
*** Error code 2

Stop.
make[1]: stopped in /usr/pkgsrc/lang/sather
*** Error code 1

Stop.
make: stopped in /usr/pkgsrc/lang/sather