=> Bootstrap dependency digest>=20211023: found digest-20220214
===> Skipping vulnerability checks.
WARNING: No /usr/pkg/pkgdb/pkg-vulnerabilities file found.
WARNING: To fix run: `/usr/sbin/pkg_admin -K /usr/pkg/pkgdb fetch-pkg-vulnerabilities'.
===> Building for oculante-0.8.16
warning: Both `/pbulk/work/graphics/oculante/work/oculante-0.8.16/.cargo/config` and `/pbulk/work/graphics/oculante/work/oculante-0.8.16/.cargo/config.toml` exist. Using `/pbulk/work/graphics/oculante/work/oculante-0.8.16/.cargo/config`
   Compiling proc-macro2 v1.0.78
   Compiling unicode-ident v1.0.12
   Compiling quote v1.0.35
   Compiling syn v2.0.49
   Compiling libc v0.2.153
   Compiling autocfg v1.1.0
   Compiling version_check v0.9.4
   Compiling cfg-if v1.0.0
   Compiling ahash v0.8.8
   Compiling pkg-config v0.3.30
   Compiling once_cell v1.19.0
   Compiling libm v0.2.8
   Compiling num-traits v0.2.18
   Compiling serde v1.0.196
   Compiling serde_derive v1.0.196
   Compiling crossbeam-utils v0.8.19
   Compiling bytemuck_derive v1.5.0
   Compiling bytemuck v1.14.3
   Compiling log v0.4.20
   Compiling zerocopy v0.7.32
   Compiling jobserver v0.1.28
   Compiling allocator-api2 v0.2.16
   Compiling smallvec v1.13.1
   Compiling hashbrown v0.14.3
   Compiling cc v1.0.83
   Compiling equivalent v1.0.1
   Compiling indexmap v2.2.3
   Compiling toml_datetime v0.6.5
   Compiling heck v0.4.1
   Compiling pin-project-lite v0.2.13
   Compiling bitflags v1.3.2
   Compiling syn v1.0.109
   Compiling typenum v1.17.0
   Compiling target-lexicon v0.12.13
   Compiling serde_spanned v0.6.5
   Compiling winnow v0.6.1
   Compiling toml_edit v0.22.6
   Compiling thiserror v1.0.57
   Compiling cfg_aliases v0.1.1
   Compiling cfg-expr v0.15.7
   Compiling toml v0.8.10
   Compiling memchr v2.7.1
   Compiling version-compare v0.1.1
   Compiling system-deps v6.2.0
   Compiling crossbeam-epoch v0.9.18
   Compiling thiserror-impl v1.0.57
   Compiling rayon-core v1.12.1
   Compiling crossbeam-deque v0.8.5
   Compiling lock_api v0.4.11
   Compiling scopeguard v1.2.0
   Compiling either v1.10.0
   Compiling libloading v0.8.1
   Compiling simd-adler32 v0.3.7
   Compiling rayon v1.8.1
   Compiling xml-rs v0.8.19
   Compiling adler v1.0.2
   Compiling rustix v0.38.31
   Compiling arrayvec v0.7.4
   Compiling futures-core v0.3.30
   Compiling crc32fast v1.4.0
   Compiling miniz_oxide v0.7.2
   Compiling num-bigint v0.4.4
   Compiling parking_lot_core v0.9.9
   Compiling lazy_static v1.4.0
   Compiling dlib v0.5.2
   Compiling cmake v0.1.50
   Compiling getrandom v0.2.12
   Compiling futures-io v0.3.30
   Compiling downcast-rs v1.2.0
   Compiling ab_glyph_rasterizer v0.1.8
   Compiling flate2 v1.0.28
   Compiling num-rational v0.4.1
   Compiling ttf-parser v0.20.0
   Compiling owned_ttf_parser v0.20.0
   Compiling parking_lot v0.12.1
   Compiling bitflags v2.4.2
   Compiling ab_glyph v0.2.23
   Compiling slab v0.4.9
   Compiling byteorder v1.5.0
   Compiling ppv-lite86 v0.2.17
   Compiling aho-corasick v1.1.2
   Compiling regex-syntax v0.8.2
   Compiling float-cmp v0.9.0
   Compiling pin-utils v0.1.0
   Compiling regex-automata v0.4.5
   Compiling generic-array v0.9.1
   Compiling wayland-scanner v0.29.5
   Compiling tracing-core v0.1.32
   Compiling memoffset v0.6.5
   Compiling tracing-attributes v0.1.27
   Compiling byte-tools v0.2.0
   Compiling wasm-bindgen-shared v0.2.91
   Compiling arrayref v0.3.7
   Compiling scoped-tls v1.0.1
   Compiling block-buffer v0.3.3
   Compiling tracing v0.1.40
   Compiling digest v0.7.6
   Compiling strict-num v0.1.1
   Compiling num-integer v0.1.46
   Compiling fdeflate v0.3.4
   Compiling futures-sink v0.3.30
   Compiling fake-simd v0.1.2
   Compiling static_assertions v1.1.0
   Compiling sha2 v0.7.1
   Compiling futures-channel v0.3.30
   Compiling png v0.17.13
   Compiling rand_core v0.6.4
   Compiling errno v0.3.8
   Compiling slotmap v1.0.7
   Compiling futures-macro v0.3.30
   Compiling futures-task v0.3.30
   Compiling khronos_api v3.1.0
   Compiling parking v2.2.0
   Compiling mint v0.5.9
   Compiling bumpalo v3.15.0
   Compiling wasm-bindgen-backend v0.2.91
   Compiling glam v0.24.2
   Compiling futures-util v0.3.30
   Compiling rand_chacha v0.3.1
   Compiling glsl-to-spirv v0.1.7
   Compiling spirv_cross v0.23.1
   Compiling wayland-sys v0.29.5
   Compiling instant v0.1.12
   Compiling fastrand v2.0.1
   Compiling siphasher v0.3.11
   Compiling tempfile v3.10.0
   Compiling rand v0.8.5
   Compiling wasm-bindgen-macro-support v0.2.91
   Compiling num-iter v0.1.44
   Compiling regex v1.10.3
   Compiling num-complex v0.4.5
   Compiling notan_macro v0.12.0
   Compiling concurrent-queue v2.4.0
   Compiling approx v0.5.1
   Compiling wasm-bindgen v0.2.91
   Compiling weezl v0.1.8
   Compiling num v0.4.1
   Compiling wasm-bindgen-macro v0.2.91
   Compiling gl_generator v0.14.0
   Compiling notan_math v0.12.0
   Compiling nix v0.24.3
   Compiling wayland-client v0.29.5
   Compiling crevice_notan-derive v0.13.0
   Compiling half v2.3.1
   Compiling generic-array v0.14.7
   Compiling color_quant v1.1.0
   Compiling serde_json v1.0.113
   Compiling gif v0.12.0
   Compiling crevice_notan v0.13.0
   Compiling wayland-commons v0.29.5
   Compiling notan_utils v0.12.0
   Compiling jpeg-decoder v0.3.1
   Compiling zune-inflate v0.2.54
   Compiling spin v0.9.8
   Compiling glib-sys v0.18.1
   Compiling rgb v0.8.37
   Compiling unicase v2.7.0
   Compiling rustc-hash v1.1.0
   Compiling tinyvec_macros v0.1.1
   Compiling tinyvec v1.6.0
   Compiling flume v0.11.0
   Compiling js-sys v0.3.68
   Compiling futures-executor v0.3.30
   Compiling wayland-protocols v0.29.5
   Compiling gobject-sys v0.18.0
   Compiling x11-dl v2.21.0
   Compiling libloading v0.7.4
   Compiling bit_field v0.10.2
   Compiling ucd-trie v0.1.6
   Compiling percent-encoding v2.3.1
   Compiling notan_core v0.12.0
   Compiling lebe v0.5.2
   Compiling exr v1.72.0
   Compiling notan_input v0.12.0
   Compiling pest v2.7.7
   Compiling futures v0.3.30
   Compiling platter2 v0.1.6
   Compiling tiff v0.9.1
   Compiling nix v0.25.1
   Compiling jxl-bitstream v0.3.2
   Compiling bstr v1.9.0
   Compiling qoi v0.4.1
   Compiling smithay-client-toolkit v0.16.1
   Compiling wayland-sys v0.31.1
   Compiling ahash v0.7.8
   Compiling xcursor v0.3.5
   Compiling winnow v0.5.40
   Compiling vec_map v0.8.2
   Compiling rustversion v1.0.14
   Compiling same-file v1.0.6
   Compiling utf8parse v0.2.1
   Compiling unic-common v0.9.0
   Compiling unic-char-range v0.9.0
   Compiling unic-char-property v0.9.0
   Compiling unic-ucd-version v0.9.0
   Compiling anstyle-parse v0.2.3
   Compiling walkdir v2.4.0
   Compiling calloop v0.10.6
   Compiling toml_edit v0.19.15
   Compiling wayland-cursor v0.29.5
   Compiling image v0.24.8
   Compiling globset v0.4.14
   Compiling jxl-coding v0.3.1
   Compiling pest_meta v2.7.7
   Compiling tiny-skia-path v0.8.4
   Compiling glutin_egl_sys v0.5.1
   Compiling glutin_glx_sys v0.4.0
   Compiling event-listener v4.0.3
   Compiling jxl-threadpool v0.1.1
   Compiling jxl-grid v0.4.0
   Compiling kurbo v0.9.5
   Compiling wayland-backend v0.3.3
   Compiling euclid v0.22.9
   Compiling emath v0.26.2
   Compiling ecolor v0.26.2
   Compiling wayland-sys v0.30.1
   Compiling memmap2 v0.5.10
   Compiling memoffset v0.7.1
   Compiling unicode-bidi v0.3.15
   Compiling nohash-hasher v0.2.0
   Compiling getrandom v0.1.16
   Compiling anstyle v1.0.6
   Compiling raw-window-handle v0.5.2
   Compiling anstyle-query v1.0.2
   Compiling colorchoice v1.0.0
   Compiling paste v1.0.14
   Compiling anstream v0.6.12
   Compiling epaint v0.26.2
   Compiling lyon_geom v1.0.5
   Compiling svgtypes v0.11.0
   Compiling event-listener-strategy v0.4.0
   Compiling tiny-skia v0.8.4
   Compiling pest_generator v2.7.7
   Compiling ignore v0.4.22
   Compiling proc-macro-crate v1.3.1
   Compiling unic-ucd-segment v0.9.0
   Compiling event-listener v5.1.0
   Compiling twox-hash v1.6.3
   Compiling winit v0.28.7
   Compiling gio-sys v0.18.1
   Compiling atk-sys v0.18.0
   Compiling gdk-sys v0.18.0
   Compiling quick-xml v0.31.0
   Compiling glutin v0.30.10
   Compiling zvariant_utils v1.0.1
   Compiling crossbeam-channel v0.5.11
   Compiling safe_arch v0.7.1
   Compiling io-lifetimes v1.0.11
   Compiling xi-unicode v0.3.0
   Compiling stable_deref_trait v1.2.0
   Compiling unicode-general-category v0.6.0
   Compiling event-listener v2.5.3
   Compiling ryu v1.0.17
   Compiling itoa v1.0.10
   Compiling linked-hash-map v0.5.6
   Compiling termcolor v1.4.1
   Compiling glyph_brush_draw_cache v0.1.5
   Compiling globwalk v0.8.1
   Compiling glyph_brush_layout v0.2.3
   Compiling wide v0.7.15
   Compiling wayland-scanner v0.31.1
   Compiling event-listener-strategy v0.5.0
   Compiling unic-segment v0.9.0
   Compiling hashbrown v0.12.3
   Compiling pest_derive v2.7.7
   Compiling mime_guess v2.0.4
   Compiling sctk-adwaita v0.5.4
   Compiling async-lock v3.3.0
   Compiling lyon_path v1.0.4
   Compiling egui v0.26.2
   Compiling futures-lite v2.2.0
   Compiling gdk-pixbuf-sys v0.18.0
   Compiling cairo-sys-rs v0.18.2
   Compiling pango-sys v0.18.0
   Compiling glutin-winit v0.3.0
   Compiling hashbrown v0.13.2
   Compiling ordered-float v4.2.0
   Compiling mio v0.8.11
   Compiling khronos-egl v6.0.0
   Compiling matrixmultiply v0.3.8
   Compiling polling v2.8.0
   Compiling enumflags2_derive v0.7.9
   Compiling atomic-waker v1.1.2
   Compiling unicode-width v0.1.11
   Compiling roxmltree v0.19.0
   Compiling proc-macro-hack v0.5.20+deprecated
   Compiling bit-vec v0.6.3
   Compiling xmlparser v0.13.6
   Compiling az v1.2.1
   Compiling rctree v0.5.0
   Compiling waker-fn v1.1.1
   Compiling strsim v0.11.0
   Compiling ash v0.37.3+1.3.251
   Compiling fastrand v1.9.0
   Compiling clap_lex v0.7.0
   Compiling rustix v0.37.27
   Compiling async-task v4.7.0
   Compiling clap_builder v4.5.1
   Compiling futures-lite v1.13.0
   Compiling usvg-tree v0.33.0
   Compiling tera v1.19.1
   Compiling roxmltree v0.18.1
   Compiling bit-set v0.5.3
   Compiling fontconfig-parser v0.5.6
   Compiling codespan-reporting v0.11.1
   Compiling piper v0.2.1
   Compiling enumflags2 v0.7.9
   Compiling glyph_brush v0.7.8
   Compiling fallible_collections v0.4.9
   Compiling rand_core v0.5.1
   Compiling nix v0.26.4
   Compiling wayland-client v0.31.2
   Compiling async-channel v2.2.0
   Compiling async-lock v2.8.0
   Compiling zvariant_derive v3.15.0
   Compiling jxl-color v0.6.0
   Compiling jxl-modular v0.6.0
   Compiling crypto-common v0.1.6
   Compiling block-buffer v0.10.4
   Compiling unicode-normalization v0.1.22
   Compiling phf_shared v0.10.0
   Compiling phf_shared v0.11.2
   Compiling spirv v0.3.0+sdk-1.3.268.0
   Compiling gpu-alloc-types v0.3.0
   Compiling gpu-descriptor-types v0.1.2
   Compiling libaom-sys v0.15.0
   Compiling gtk-sys v0.18.0
   Compiling wgpu-hal v0.19.1
   Compiling clap_derive v4.5.0
   Compiling simplecss v0.2.1
   Compiling memmap2 v0.6.2
   Compiling async-fs v1.6.0
   Compiling async-io v1.13.0
   Compiling ttf-parser v0.19.2
   Compiling async-trait v0.1.77
   Compiling glow v0.12.3
   Compiling ttf-parser v0.18.1
   Compiling minimal-lexical v0.2.1
   Compiling unicode-script v0.5.5
   Compiling unicode-bidi-mirroring v0.1.0
   Compiling unicode-xid v0.2.4
   Compiling mime v0.3.17
   Compiling fixed v1.25.1
   Compiling fixedbitset v0.4.2
   Compiling hexf-parse v0.2.1
   Compiling doc-comment v0.3.3
   Compiling rawpointer v0.2.1
   Compiling float_next_after v1.0.0
   Compiling unicode-ccc v0.1.2
   Compiling rustybuzz v0.7.0
   Compiling lyon_tessellation v1.0.13
   Compiling naga v0.19.0
   Compiling petgraph v0.6.4
   Compiling nom v7.1.3
   Compiling fontdb v0.14.1
   Compiling rosvgtree v0.3.0
   Compiling clap v4.5.1
   Compiling gpu-descriptor v0.2.4
   Compiling gpu-alloc v0.6.0
   Compiling phf_generator v0.11.2
   Compiling phf_generator v0.10.0
   Compiling idna v0.5.0
   Compiling digest v0.10.7
   Compiling jxl-vardct v0.6.0
   Compiling jxl-image v0.8.0
   Compiling zvariant v3.15.0
   Compiling blocking v1.5.1
   Compiling wayland-protocols v0.31.2
   Compiling rand_chacha v0.2.2
   Compiling lutgen-palettes v0.2.7
   Compiling lyon_algorithms v1.0.4
   Compiling as-slice v0.2.1
   Compiling strum_macros v0.24.3
   Compiling form_urlencoded v1.2.1
   Compiling env_filter v0.1.0
   Compiling wgpu-types v0.19.0
   Compiling wgpu-core v0.19.0
   Compiling libwebp-sys2 v0.1.9
   Compiling basis-universal-sys v0.3.1
   Compiling toml v0.5.11
   Compiling socket2 v0.4.10
   Compiling bitreader v0.3.8
   Compiling indexmap v1.9.3
   Compiling unicode-vo v0.1.0
   Compiling option-ext v0.2.0
   Compiling cpufeatures v0.2.12
   Compiling raw-window-handle v0.6.0
   Compiling ttf-parser v0.15.2
   Compiling profiling v1.0.15
   Compiling data-url v0.2.0
   Compiling bytecount v0.6.7
   Compiling humantime v2.1.0
   Compiling glow v0.13.1
   Compiling renderdoc-sys v1.0.0
   Compiling fnv v1.0.7
   Compiling imgref v1.10.1
   Compiling dlv-list v0.3.0
   Compiling imagesize v0.12.0
   Compiling usvg-parser v0.33.0
   Compiling ordered-multimap v0.4.3
   Compiling tree_magic_mini v3.0.3
   Compiling env_logger v0.11.2
   Compiling owned_ttf_parser v0.15.2
   Compiling sha1 v0.10.6
   Compiling dirs-sys v0.4.1
   Compiling usvg-text-layout v0.33.0
   Compiling avif-parse v1.0.0
   Compiling winres v0.1.12
   Compiling url v2.5.0
   Compiling strum v0.24.1
   Compiling aligned v0.4.1
   Compiling lyon v1.0.1
   Compiling phf_macros v0.10.0
   Compiling rand v0.7.3
   Compiling wayland-protocols-wlr v0.2.0
   Compiling zbus_names v2.6.0
   Compiling jxl-frame v0.8.0
   Compiling phf_macros v0.11.2
   Compiling async-executor v1.8.0
   Compiling simba v0.7.3
   Compiling async-broadcast v0.5.1
   Compiling zbus_macros v3.15.0
   Compiling aligned-array v1.0.1
   Compiling yuv v0.1.5
   Compiling tiny-skia-path v0.9.0
   Compiling ordered-stream v0.2.0
   Compiling wgpu v0.19.1
   Compiling derivative v2.2.0
   Compiling derive-new v0.5.9
   Compiling num-traits v0.1.43
   Compiling os_pipe v1.1.5
   Compiling xdg-home v1.1.0
   Compiling dirs-sys v0.3.7
   Compiling serde_repr v0.1.18
   Compiling async-recursion v1.0.5
   Compiling pico-args v0.5.0
   Compiling xmlwriter v0.1.0
   Compiling maplit v1.0.2
   Compiling min-max-heap v1.3.0
   Compiling anyhow v1.0.80
   Compiling palette v0.7.4
   Compiling os_str_bytes v6.6.1
   Compiling rfd v0.13.0
   Compiling iana-time-zone v0.1.60
   Compiling hex v0.4.3
   Compiling dark-light v1.0.0
   Compiling base64 v0.21.7
   Compiling divrem v1.0.0
   Compiling custom_derive v0.1.7
   Compiling quick-error v2.0.1
   Compiling x11rb-protocol v0.13.0
   Compiling elapsed v0.1.2
   Compiling kiddo v2.1.2
error[E0432]: unresolved import `std::arch::x86_64`
 --> /pbulk/work/graphics/oculante/work/vendor/kiddo-2.1.2/src/distance.rs:7:16
  |
7 | use std::arch::x86_64::*;
  |                ^^^^^^ could not find `x86_64` in `arch`

error[E0412]: cannot find type `__m128` in this scope
  --> /pbulk/work/graphics/oculante/work/vendor/kiddo-2.1.2/src/distance.rs:12:11
   |
12 |     simd: __m128,
   |           ^^^^^^ not found in this scope
   |
help: consider importing one of these items
   |
4  + use core::arch::x86::__m128;
   |
4  + use std::arch::x86::__m128;
   |

error[E0425]: cannot find function `_mm_loadu_ps` in this scope
  --> /pbulk/work/graphics/oculante/work/vendor/kiddo-2.1.2/src/distance.rs:33:16
   |
33 |     let a_mm = _mm_loadu_ps(a);
   |                ^^^^^^^^^^^^ not found in this scope
   |
help: consider importing one of these items
   |
4  + use core::arch::x86::_mm_loadu_ps;
   |
4  + use std::arch::x86::_mm_loadu_ps;
   |

error[E0425]: cannot find function `_mm_loadu_ps` in this scope
  --> /pbulk/work/graphics/oculante/work/vendor/kiddo-2.1.2/src/distance.rs:34:16
   |
34 |     let b_mm = _mm_loadu_ps(b);
   |                ^^^^^^^^^^^^ not found in this scope
   |
help: consider importing one of these items
   |
4  + use core::arch::x86::_mm_loadu_ps;
   |
4  + use std::arch::x86::_mm_loadu_ps;
   |

error[E0425]: cannot find function `_mm_dp_ps` in this scope
  --> /pbulk/work/graphics/oculante/work/vendor/kiddo-2.1.2/src/distance.rs:37:15
   |
37 |         simd: _mm_dp_ps(a_mm, b_mm, 0x71),
   |               ^^^^^^^^^ not found in this scope
   |
help: consider importing one of these items
   |
4  + use core::arch::x86::_mm_dp_ps;
   |
4  + use std::arch::x86::_mm_dp_ps;
   |

error[E0425]: cannot find function `_mm_load_ps` in this scope
  --> /pbulk/work/graphics/oculante/work/vendor/kiddo-2.1.2/src/distance.rs:46:16
   |
46 |     let a_mm = _mm_load_ps(a);
   |                ^^^^^^^^^^^ not found in this scope
   |
help: consider importing one of these items
   |
4  + use core::arch::x86::_mm_load_ps;
   |
4  + use std::arch::x86::_mm_load_ps;
   |

error[E0425]: cannot find function `_mm_load_ps` in this scope
  --> /pbulk/work/graphics/oculante/work/vendor/kiddo-2.1.2/src/distance.rs:47:16
   |
47 |     let b_mm = _mm_load_ps(b);
   |                ^^^^^^^^^^^ not found in this scope
   |
help: consider importing one of these items
   |
4  + use core::arch::x86::_mm_load_ps;
   |
4  + use std::arch::x86::_mm_load_ps;
   |

error[E0425]: cannot find function `_mm_dp_ps` in this scope
  --> /pbulk/work/graphics/oculante/work/vendor/kiddo-2.1.2/src/distance.rs:50:15
   |
50 |         simd: _mm_dp_ps(a_mm, b_mm, 0x71),
   |               ^^^^^^^^^ not found in this scope
   |
help: consider importing one of these items
   |
4  + use core::arch::x86::_mm_dp_ps;
   |
4  + use std::arch::x86::_mm_dp_ps;
   |

Some errors have detailed explanations: E0412, E0425, E0432.
For more information about an error, try `rustc --explain E0412`.
error: could not compile `kiddo` (lib) due to 8 previous errors
warning: build failed, waiting for other jobs to finish...
*** Error code 101

Stop.
make[1]: stopped in /usr/pkgsrc/graphics/oculante
*** Error code 1

Stop.
make: stopped in /usr/pkgsrc/graphics/oculante