=> Bootstrap dependency digest>=20211023: found digest-20220214
===> Skipping vulnerability checks.
WARNING: No /usr/pkg/pkgdb/pkg-vulnerabilities file found.
WARNING: To fix run: `/usr/sbin/pkg_admin -K /usr/pkg/pkgdb fetch-pkg-vulnerabilities'.
===> Building for freedv-1.4.2nb18
[ 12%] Building CXX object src/CMakeFiles/freedv.dir/dlg_filter.cpp.o
[ 12%] Building CXX object src/CMakeFiles/freedv.dir/dlg_options.cpp.o
[ 12%] Building CXX object src/CMakeFiles/freedv.dir/dlg_audiooptions.cpp.o
[ 16%] Building CXX object src/CMakeFiles/freedv.dir/fdmdv2_plot.cpp.o
[ 20%] Building CXX object src/CMakeFiles/freedv.dir/fdmdv2_main.cpp.o
[ 25%] Building CXX object src/CMakeFiles/freedv.dir/dlg_ptt.cpp.o
[ 29%] Building CXX object src/CMakeFiles/freedv.dir/dlg_plugin.cpp.o
[ 33%] Building CXX object src/CMakeFiles/freedv.dir/fdmdv2_pa_wrapper.cpp.o
In file included from /pbulk/work/ham/freedv/work/freedv-gui-bb9558cc496b7b253fb54bb28486b0bcd7516ae5/src/dlg_audiooptions.cpp:22:0:
/pbulk/work/ham/freedv/work/freedv-gui-bb9558cc496b7b253fb54bb28486b0bcd7516ae5/src/fdmdv2_main.h:92:10: fatal error: varicode.h: No such file or directory
 #include "varicode.h"
          ^~~~~~~~~~~~
compilation terminated.
In file included from /pbulk/work/ham/freedv/work/freedv-gui-bb9558cc496b7b253fb54bb28486b0bcd7516ae5/src/dlg_filter.h:25:0,
                 from /pbulk/work/ham/freedv/work/freedv-gui-bb9558cc496b7b253fb54bb28486b0bcd7516ae5/src/dlg_filter.cpp:21:
/pbulk/work/ham/freedv/work/freedv-gui-bb9558cc496b7b253fb54bb28486b0bcd7516ae5/src/fdmdv2_main.h:92:10: fatal error: varicode.h: No such file or directory
 #include "varicode.h"
          ^~~~~~~~~~~~
compilation terminated.
In file included from /pbulk/work/ham/freedv/work/freedv-gui-bb9558cc496b7b253fb54bb28486b0bcd7516ae5/src/dlg_options.h:25:0,
                 from /pbulk/work/ham/freedv/work/freedv-gui-bb9558cc496b7b253fb54bb28486b0bcd7516ae5/src/dlg_options.cpp:22:
/pbulk/work/ham/freedv/work/freedv-gui-bb9558cc496b7b253fb54bb28486b0bcd7516ae5/src/fdmdv2_main.h:92:10: fatal error: varicode.h: No such file or directory
 #include "varicode.h"
          ^~~~~~~~~~~~
compilation terminated.
--- src/CMakeFiles/freedv.dir/dlg_audiooptions.cpp.o ---
*** [src/CMakeFiles/freedv.dir/dlg_audiooptions.cpp.o] Error code 1

make[2]: stopped in /pbulk/work/ham/freedv/work/freedv-gui-bb9558cc496b7b253fb54bb28486b0bcd7516ae5/cmake-pkgsrc-build
--- src/CMakeFiles/freedv.dir/dlg_filter.cpp.o ---
*** [src/CMakeFiles/freedv.dir/dlg_filter.cpp.o] Error code 1

make[2]: stopped in /pbulk/work/ham/freedv/work/freedv-gui-bb9558cc496b7b253fb54bb28486b0bcd7516ae5/cmake-pkgsrc-build
--- src/CMakeFiles/freedv.dir/dlg_options.cpp.o ---
*** [src/CMakeFiles/freedv.dir/dlg_options.cpp.o] Error code 1

make[2]: stopped in /pbulk/work/ham/freedv/work/freedv-gui-bb9558cc496b7b253fb54bb28486b0bcd7516ae5/cmake-pkgsrc-build
In file included from /pbulk/work/ham/freedv/work/freedv-gui-bb9558cc496b7b253fb54bb28486b0bcd7516ae5/src/dlg_ptt.h:25:0,
                 from /pbulk/work/ham/freedv/work/freedv-gui-bb9558cc496b7b253fb54bb28486b0bcd7516ae5/src/dlg_ptt.cpp:22:
/pbulk/work/ham/freedv/work/freedv-gui-bb9558cc496b7b253fb54bb28486b0bcd7516ae5/src/fdmdv2_main.h:92:10: fatal error: varicode.h: No such file or directory
 #include "varicode.h"
          ^~~~~~~~~~~~
compilation terminated.
--- src/CMakeFiles/freedv.dir/dlg_ptt.cpp.o ---
*** [src/CMakeFiles/freedv.dir/dlg_ptt.cpp.o] Error code 1

make[2]: stopped in /pbulk/work/ham/freedv/work/freedv-gui-bb9558cc496b7b253fb54bb28486b0bcd7516ae5/cmake-pkgsrc-build
In file included from /pbulk/work/ham/freedv/work/freedv-gui-bb9558cc496b7b253fb54bb28486b0bcd7516ae5/src/dlg_plugin.h:25:0,
                 from /pbulk/work/ham/freedv/work/freedv-gui-bb9558cc496b7b253fb54bb28486b0bcd7516ae5/src/dlg_plugin.cpp:23:
/pbulk/work/ham/freedv/work/freedv-gui-bb9558cc496b7b253fb54bb28486b0bcd7516ae5/src/fdmdv2_main.h:92:10: fatal error: varicode.h: No such file or directory
 #include "varicode.h"
          ^~~~~~~~~~~~
compilation terminated.
--- src/CMakeFiles/freedv.dir/dlg_plugin.cpp.o ---
*** [src/CMakeFiles/freedv.dir/dlg_plugin.cpp.o] Error code 1

make[2]: stopped in /pbulk/work/ham/freedv/work/freedv-gui-bb9558cc496b7b253fb54bb28486b0bcd7516ae5/cmake-pkgsrc-build
In file included from /pbulk/work/ham/freedv/work/freedv-gui-bb9558cc496b7b253fb54bb28486b0bcd7516ae5/src/fdmdv2_main.cpp:23:0:
/pbulk/work/ham/freedv/work/freedv-gui-bb9558cc496b7b253fb54bb28486b0bcd7516ae5/src/fdmdv2_main.h:92:10: fatal error: varicode.h: No such file or directory
 #include "varicode.h"
          ^~~~~~~~~~~~
compilation terminated.
--- src/CMakeFiles/freedv.dir/fdmdv2_main.cpp.o ---
*** [src/CMakeFiles/freedv.dir/fdmdv2_main.cpp.o] Error code 1

make[2]: stopped in /pbulk/work/ham/freedv/work/freedv-gui-bb9558cc496b7b253fb54bb28486b0bcd7516ae5/cmake-pkgsrc-build
6 errors

make[2]: stopped in /pbulk/work/ham/freedv/work/freedv-gui-bb9558cc496b7b253fb54bb28486b0bcd7516ae5/cmake-pkgsrc-build
--- src/CMakeFiles/freedv.dir/all ---
*** [src/CMakeFiles/freedv.dir/all] Error code 2

make[1]: stopped in /pbulk/work/ham/freedv/work/freedv-gui-bb9558cc496b7b253fb54bb28486b0bcd7516ae5/cmake-pkgsrc-build
1 error

make[1]: stopped in /pbulk/work/ham/freedv/work/freedv-gui-bb9558cc496b7b253fb54bb28486b0bcd7516ae5/cmake-pkgsrc-build
*** [all] Error code 2

make: stopped in /pbulk/work/ham/freedv/work/freedv-gui-bb9558cc496b7b253fb54bb28486b0bcd7516ae5/cmake-pkgsrc-build
1 error

make: stopped in /pbulk/work/ham/freedv/work/freedv-gui-bb9558cc496b7b253fb54bb28486b0bcd7516ae5/cmake-pkgsrc-build
*** Error code 2

Stop.
make[1]: stopped in /usr/pkgsrc/ham/freedv
*** Error code 1

Stop.
make: stopped in /usr/pkgsrc/ham/freedv