=> Bootstrap dependency digest>=20211023: found digest-20220214
===> Skipping vulnerability checks.
WARNING: No /usr/pkg/pkgdb/pkg-vulnerabilities file found.
WARNING: To fix run: `/usr/sbin/pkg_admin -K /usr/pkg/pkgdb fetch-pkg-vulnerabilities'.
===> Building for swtpm-0.7.0nb6
/usr/pkg/bin/gmake  all-recursive
gmake[1]: Entering directory '/pbulk/work/sysutils/swtpm/work/swtpm-0.7.0'
Making all in include
gmake[2]: Entering directory '/pbulk/work/sysutils/swtpm/work/swtpm-0.7.0/include'
Making all in swtpm
gmake[3]: Entering directory '/pbulk/work/sysutils/swtpm/work/swtpm-0.7.0/include/swtpm'
gmake[3]: Nothing to be done for 'all'.
gmake[3]: Leaving directory '/pbulk/work/sysutils/swtpm/work/swtpm-0.7.0/include/swtpm'
gmake[3]: Entering directory '/pbulk/work/sysutils/swtpm/work/swtpm-0.7.0/include'
gmake[3]: Nothing to be done for 'all-am'.
gmake[3]: Leaving directory '/pbulk/work/sysutils/swtpm/work/swtpm-0.7.0/include'
gmake[2]: Leaving directory '/pbulk/work/sysutils/swtpm/work/swtpm-0.7.0/include'
Making all in man
gmake[2]: Entering directory '/pbulk/work/sysutils/swtpm/work/swtpm-0.7.0/man'
Making all in man3
gmake[3]: Entering directory '/pbulk/work/sysutils/swtpm/work/swtpm-0.7.0/man/man3'
gmake[3]: Leaving directory '/pbulk/work/sysutils/swtpm/work/swtpm-0.7.0/man/man3'
Making all in man8
gmake[3]: Entering directory '/pbulk/work/sysutils/swtpm/work/swtpm-0.7.0/man/man8'
gmake[3]: Leaving directory '/pbulk/work/sysutils/swtpm/work/swtpm-0.7.0/man/man8'
gmake[3]: Entering directory '/pbulk/work/sysutils/swtpm/work/swtpm-0.7.0/man'
gmake[3]: Nothing to be done for 'all-am'.
gmake[3]: Leaving directory '/pbulk/work/sysutils/swtpm/work/swtpm-0.7.0/man'
gmake[2]: Leaving directory '/pbulk/work/sysutils/swtpm/work/swtpm-0.7.0/man'
Making all in samples
gmake[2]: Entering directory '/pbulk/work/sysutils/swtpm/work/swtpm-0.7.0/samples'
gmake[2]: Nothing to be done for 'all'.
gmake[2]: Leaving directory '/pbulk/work/sysutils/swtpm/work/swtpm-0.7.0/samples'
Making all in src
gmake[2]: Entering directory '/pbulk/work/sysutils/swtpm/work/swtpm-0.7.0/src'
Making all in utils
gmake[3]: Entering directory '/pbulk/work/sysutils/swtpm/work/swtpm-0.7.0/src/utils'
  CC       libswtpm_utils_la-swtpm_utils.lo
  CCLD     libswtpm_utils.la
gmake[3]: Leaving directory '/pbulk/work/sysutils/swtpm/work/swtpm-0.7.0/src/utils'
Making all in swtpm
gmake[3]: Entering directory '/pbulk/work/sysutils/swtpm/work/swtpm-0.7.0/src/swtpm'
  CC       swtpm-main.o
  CC       swtpm-daemonize.o
  CC       swtpm-swtpm.o
  CC       swtpm-swtpm_chardev.o
  CC       libswtpm_libtpms_la-capabilities.lo
  CC       libswtpm_libtpms_la-common.lo
  CC       libswtpm_libtpms_la-ctrlchannel.lo
  CC       libswtpm_libtpms_la-key.lo
  CC       libswtpm_libtpms_la-logging.lo
  CC       libswtpm_libtpms_la-mainloop.lo
  CC       libswtpm_libtpms_la-options.lo
  CC       libswtpm_libtpms_la-pidfile.lo
  CC       libswtpm_libtpms_la-seccomp_profile.lo
  CC       libswtpm_libtpms_la-server.lo
  CC       libswtpm_libtpms_la-swtpm_aes.lo
  CC       libswtpm_libtpms_la-swtpm_debug.lo
  CC       libswtpm_libtpms_la-swtpm_nvstore.lo
  CC       libswtpm_libtpms_la-swtpm_io.lo
  CC       libswtpm_libtpms_la-swtpm_nvstore_dir.lo
  CC       libswtpm_libtpms_la-swtpm_nvstore_linear.lo
  CC       libswtpm_libtpms_la-swtpm_nvstore_linear_file.lo
  CC       libswtpm_libtpms_la-tlv.lo
  CC       libswtpm_libtpms_la-tpmlib.lo
  CC       libswtpm_libtpms_la-tpmstate.lo
  CC       libswtpm_libtpms_la-utils.lo
  CCLD     libswtpm_libtpms.la
  CCLD     swtpm
gmake[3]: Leaving directory '/pbulk/work/sysutils/swtpm/work/swtpm-0.7.0/src/swtpm'
Making all in swtpm_bios
gmake[3]: Entering directory '/pbulk/work/sysutils/swtpm/work/swtpm-0.7.0/src/swtpm_bios'
  CC       swtpm_bios-tpm_bios.o
  CCLD     swtpm_bios
gmake[3]: Leaving directory '/pbulk/work/sysutils/swtpm/work/swtpm-0.7.0/src/swtpm_bios'
Making all in swtpm_cert
gmake[3]: Entering directory '/pbulk/work/sysutils/swtpm/work/swtpm-0.7.0/src/swtpm_cert'
  CC       swtpm_cert-ek-cert.o
  CCLD     swtpm_cert
ld: cannot find -lp11-kit
gmake[3]: *** [Makefile:476: swtpm_cert] Error 1
gmake[3]: Leaving directory '/pbulk/work/sysutils/swtpm/work/swtpm-0.7.0/src/swtpm_cert'
gmake[2]: *** [Makefile:416: all-recursive] Error 1
gmake[2]: Leaving directory '/pbulk/work/sysutils/swtpm/work/swtpm-0.7.0/src'
gmake[1]: *** [Makefile:480: all-recursive] Error 1
gmake[1]: Leaving directory '/pbulk/work/sysutils/swtpm/work/swtpm-0.7.0'
gmake: *** [Makefile:408: all] Error 2
*** Error code 2

Stop.
make[1]: stopped in /usr/pkgsrc/sysutils/swtpm
*** Error code 1

Stop.
make: stopped in /usr/pkgsrc/sysutils/swtpm