=> Bootstrap dependency digest>=20211023: found digest-20220214
===> Skipping vulnerability checks.
WARNING: No /usr/pkg/pkgdb/pkg-vulnerabilities file found.
WARNING: To fix run: `/usr/sbin/pkg_admin -K /usr/pkg/pkgdb fetch-pkg-vulnerabilities'.
===> Building for ibus-libpinyin-1.12.0nb9
/usr/pkg/bin/gmake  all-recursive
gmake[1]: Entering directory '/pbulk/work/inputmethod/ibus-libpinyin/work/ibus-libpinyin-1.12.0'
Making all in data
gmake[2]: Entering directory '/pbulk/work/inputmethod/ibus-libpinyin/work/ibus-libpinyin-1.12.0/data'
Making all in icons
gmake[3]: Entering directory '/pbulk/work/inputmethod/ibus-libpinyin/work/ibus-libpinyin-1.12.0/data/icons'
gmake[3]: Nothing to be done for 'all'.
gmake[3]: Leaving directory '/pbulk/work/inputmethod/ibus-libpinyin/work/ibus-libpinyin-1.12.0/data/icons'
gmake[3]: Entering directory '/pbulk/work/inputmethod/ibus-libpinyin/work/ibus-libpinyin-1.12.0/data'
  GEN      english.db
  GEN      ibus-setup-libbopomofo.desktop
  GEN      ibus-setup-libpinyin.desktop
  GEN      strokes.db
  GEN      com.github.libpinyin.ibus-libpinyin.gschema.valid
sed -e 's|@libexecdir[@]|/usr/pkg/libexec|g' \
-e 's|@pkgdatadir[@]|/usr/pkg/share/ibus-libpinyin|g' ibus-setup-libbopomofo.desktop.tmp > ibus-setup-libbopomofo.desktop
sed -e 's|@libexecdir[@]|/usr/pkg/libexec|g' \
-e 's|@pkgdatadir[@]|/usr/pkg/share/ibus-libpinyin|g' ibus-setup-libpinyin.desktop.tmp > ibus-setup-libpinyin.desktop
rm ibus-setup-libpinyin.desktop.tmp
rm ibus-setup-libbopomofo.desktop.tmp
gmake[3]: Leaving directory '/pbulk/work/inputmethod/ibus-libpinyin/work/ibus-libpinyin-1.12.0/data'
gmake[2]: Leaving directory '/pbulk/work/inputmethod/ibus-libpinyin/work/ibus-libpinyin-1.12.0/data'
Making all in src
gmake[2]: Entering directory '/pbulk/work/inputmethod/ibus-libpinyin/work/ibus-libpinyin-1.12.0/src'
/usr/pkg/bin/gmake  all-am
gmake[3]: Entering directory '/pbulk/work/inputmethod/ibus-libpinyin/work/ibus-libpinyin-1.12.0/src'
  CXX      ibus_engine_libpinyin-PYConfig.o
  CXX      ibus_engine_libpinyin-PYEngine.o
  CXX      ibus_engine_libpinyin-PYHalfFullConverter.o
  CXX      ibus_engine_libpinyin-PYFallbackEditor.o
  CXX      ibus_engine_libpinyin-PYPinyinProperties.o
  CXX      ibus_engine_libpinyin-PYPunctEditor.o
  CXX      ibus_engine_libpinyin-PYMain.o
  CXX      ibus_engine_libpinyin-PYEditor.o
  CXX      ibus_engine_libpinyin-PYSimpTradConverter.o
PYMain.cc: In function 'int main(gint, gchar**)':
PYMain.cc:183:24: warning: 'void g_atexit(GVoidFunc)' is deprecated [-Wdeprecated-declarations]
     g_atexit (atexit_cb);
                        ^
In file included from /pbulk/work/inputmethod/ibus-libpinyin/work/.buildlink/include/glib-2.0/glib/gthread.h:36:0,
                 from /pbulk/work/inputmethod/ibus-libpinyin/work/.buildlink/include/glib-2.0/glib/gasyncqueue.h:34,
                 from /pbulk/work/inputmethod/ibus-libpinyin/work/.buildlink/include/glib-2.0/glib.h:34,
                 from /pbulk/work/inputmethod/ibus-libpinyin/work/.buildlink/include/ibus-1.0/ibusshare.h:40,
                 from /pbulk/work/inputmethod/ibus-libpinyin/work/.buildlink/include/ibus-1.0/ibus.h:30,
                 from PYMain.cc:24:
/pbulk/work/inputmethod/ibus-libpinyin/work/.buildlink/include/glib-2.0/glib/gutils.h:329:6: note: declared here
 void g_atexit  (GVoidFunc    func);
      ^~~~~~~~
  CXX      ibus_engine_libpinyin-PYPConfig.o
  CXX      ibus_engine_libpinyin-PYLibPinyin.o
  CXX      ibus_engine_libpinyin-PYPPhoneticEditor.o
  CXX      ibus_engine_libpinyin-PYPPinyinEditor.o
  CXX      ibus_engine_libpinyin-PYPFullPinyinEditor.o
  CXX      ibus_engine_libpinyin-PYPDoublePinyinEditor.o
  CXX      ibus_engine_libpinyin-PYPBopomofoEditor.o
  CXX      ibus_engine_libpinyin-PYPPinyinEngine.o
  CXX      ibus_engine_libpinyin-PYPBopomofoEngine.o
  CXX      ibus_engine_libpinyin-PYPLibPinyinCandidates.o
  CXX      ibus_engine_libpinyin-PYPTradCandidates.o
  CXX      ibus_engine_libpinyin-PYPSuggestionEditor.o
  CXX      ibus_engine_libpinyin-PYPSuggestionCandidates.o
  CXX      ibus_engine_libpinyin-PYPEmojiCandidates.o
  CXX      ibus_engine_libpinyin-PYStrokeEditor.o
  CXX      ibus_engine_libpinyin-PYEnglishEditor.o
In file included from PYPSuggestionCandidates.cc:22:0:
PYPSuggestionCandidates.cc: In member function 'gboolean PY::SuggestionCandidates::processCandidates(std::vector<PY::EnhancedCandidate>&)':
PYPSuggestionCandidates.cc:42:17: error: 'PREDICTED_CANDIDATE' was not declared in this scope
         assert (PREDICTED_CANDIDATE == type);
                 ^
PYPSuggestionCandidates.cc:42:17: note: suggested alternative: 'PREDICTED_PREFIX_CANDIDATE'
gmake[3]: *** [Makefile:1089: ibus_engine_libpinyin-PYPSuggestionCandidates.o] Error 1
gmake[3]: *** Waiting for unfinished jobs....
gmake[3]: Leaving directory '/pbulk/work/inputmethod/ibus-libpinyin/work/ibus-libpinyin-1.12.0/src'
gmake[2]: *** [Makefile:642: all] Error 2
gmake[2]: Leaving directory '/pbulk/work/inputmethod/ibus-libpinyin/work/ibus-libpinyin-1.12.0/src'
gmake[1]: *** [Makefile:503: all-recursive] Error 1
gmake[1]: Leaving directory '/pbulk/work/inputmethod/ibus-libpinyin/work/ibus-libpinyin-1.12.0'
gmake: *** [Makefile:433: all] Error 2
*** Error code 2

Stop.
make[1]: stopped in /usr/pkgsrc/inputmethod/ibus-libpinyin
*** Error code 1

Stop.
make: stopped in /usr/pkgsrc/inputmethod/ibus-libpinyin